{"text_format":"1","workbook":"xlsx","n_sheets":10,"sheets":["Disclaimer","CORTEC","Configurator","Master Text","BOM","Database","Aux Units","Date Drivers","Routing","Routing DB"],"not_rendered":{"charts":0,"images":0,"macros":1,"external_links":0,"defined_names":12,"comments":0,"pivot_tables":0},"unopened":[],"bounds":{"document_bytes":16777216,"sheet_cells":100000,"rows_first":2000,"rows_last":500,"rows_between":2000,"halvings":0,"cell_chars":16384,"cell_head_chars":4096},"cells_cut":0,"cells_raw":0,"read":"whole","date_system":"1900"}

{"sheet":"Disclaimer","index":0,"n_rows":6,"n_cols":2,"rows_kept":6,"cut":false,"hidden":false,"merged":[[2,1,2,9],[5,1,7,9],[3,1,4,9]]}
["THIS PRODUCT IS NOW OBSOLETE"]
[]
[null,"Our policy is one of continuous development. Accordingly the design of our products may change at any time. "]
[null,"Whilst every effort is made to produce up to date literature, this document should only be regarded as a guide and is intended for information purposes only."]
[]
[null,"Its contents do not constitute an offer for sale or advice on the application of any product referred to in it. We cannot be held responsible for any reliance on any decisions taken on its contents without specific advice."]

{"sheet":"CORTEC","index":1,"n_rows":52,"n_cols":14,"rows_kept":52,"cut":false,"hidden":false,"merged":[]}
["Ordering information"]
["THIS PRODUCT IS NOW OBSOLETE"]
["Variants Order No.     "]
["Low Burden Electrical Reset Tripping Relay with Instantaneous Cut Off",null,null,null,"MVAJ14",null,1,null,null,null,null,null,null,"A"]
["Case"]
["Housed in a size 2 Case (5 Contact Option Only)",null,"Blue case/Grey cover",null,null,"J"]
[null,null,"Grey case/Grey cover",null,null,"R"]
["Housed in a size 4 Case (8 & 10 Contact Options Only)",null,"Blue case/Grey cover",null,null,"L"]
[null,null,"Grey case/Grey cover",null,null,"T"]
[]
["Number of Contacts"]
["Five Pair Outgoing Contacts",null,null,null,null,null,null,"B"]
["Eight Pair Outgoing Contacts ",null,null,null,null,null,null,"E"]
["Ten Pair Outgoing Contacts",null,null,null,null,null,null,"G"]
[]
["Flagging"]
["Without Flag Indicator",null,null,null,null,null,null,null,"A"]
["With Hand Reset Flag Indicator",null,null,null,null,null,null,null,"B"]
["With Self Reset Flag Indicator",null,null,null,null,null,null,null,"E"]
[]
["Voltage & Contact Combinations"]
["Voltage Options"]
["24/27 Vac/Vdc",null,null,null,null,null,null,null,null,0,0,0,0]
["30/34 Vac/Vdc",null,null,null,null,null,null,null,null,0,2,5,0]
["48/54 Vac/Vdc",null,null,null,null,null,null,null,null,0,5,0,0]
["110/125 Vac/Vdc",null,null,null,null,null,null,null,null,0,7,5,0]
["220/250 Vac/Vdc",null,null,null,null,null,null,null,null,1,0,0,0]
["Plus Contact Configuration Options"]
["5 Make (5M)",null,null,null,null,null,null,null,null,0,0,0,1]
["4 Make + 1 Break (4M+1B)",null,null,null,null,null,null,null,null,0,0,0,2]
{"$rows_left_out":23}
{"sheet":"Configurator","index":2,"n_rows":18,"n_cols":8,"rows_kept":18,"cut":false,"hidden":false,"merged":[[4,0,4,2],[3,1,3,2],[13,4,15,4]]}
["Electrical Reset Contacts with Instantaneous Cut Off Low Burden Tripping Relay - MVAJ14"]
["THIS PRODUCT IS NOW OBSOLETE"]
[null,"Format = dd/mm/yyy (where d=day, m=month, y=year)"]
[null,"1 - 6   ",null,"7 - 8",9,10,"11-14",15]
["PCS     VARIANT                   MVAJ14",null,null,{"$f":"D8","v":"R1"},{"$f":"$D$10","v":"B"},{"$f":"D12","v":"A"},{"$f":"VLOOKUP(Database!$I$6,Database!$I$7:$J$101,2,FALSE)","v":"0001"},{"$f":"$D$18","v":"F"}]
[null,null,null,{"$f":"#REF!","v":{"$error":"#REF!"}},{"$f":"#REF!","v":{"$error":"#REF!"}},{"$f":"VLOOKUP(#REF!,#REF!,4)","v":{"$error":"#REF!"}},{"$f":"#REF!","v":{"$error":"#REF!"}},{"$f":"VLOOKUP(#REF!,#REF!,3)","v":{"$error":"#REF!"}}]
["Case Size and Mounting (Dependant on Number of Contacts)"]
[{"$f":"VLOOKUP(Database!$A$75,Database!$A$76:$C$78,2,FALSE)","v":"Housed in a Size 2 Case"},null,null,{"$f":"VLOOKUP(Database!$A$75,Database!$A$76:$C$78,3,FALSE)","v":"R1"}]
["Number of Contacts"]
[null,null,null,{"$f":"VLOOKUP(Database!$B$2,Database!$A$3:$C$5,3,FALSE)","v":"B"}]
["Flagging"]
[null,null,null,{"$f":"VLOOKUP(Database!$B$25,Database!$A$26:$C$28,3,FALSE)","v":"A"}]
["Contact Combination"]
[null,null,null,{"$f":"VLOOKUP(Database!$B$7,Database!$A$8:$C$16,3,FALSE)","v":"0001"},{"$f":"D14+D16","v":1}]
["Voltage Rating",null,null,"plus"]
[null,null,null,{"$f":"VLOOKUP(Database!$B$18,Database!$A$19:$C$23,3,FALSE)","v":"0000"}]
["Issue"]
[null,null,null,{"$f":"VLOOKUP(Database!$E$65,Database!$E$66:$F$72,2,FALSE)","v":"F"}]

{"sheet":"Master Text","index":3,"n_rows":55,"n_cols":4,"rows_kept":55,"cut":false,"hidden":false,"merged":[]}
["THIS PRODUCT IS NOW OBSOLETE"]
[{"$f":"BOM!A2","v":"MVAJ14R1BA0001F"}]
["Low Burden Electrically Reset Control Relay"]
[{"$f":"CONCATENATE(\"With Instantaneous Cut Off \",VLOOKUP(Database!$B$25,Database!$A$26:$B$28,2,FALSE))","v":"With Instantaneous Cut Off Without Flag Indicator"}]
[{"$f":"VLOOKUP(Database!$F$38,Database!$F$39:$G$41,2,FALSE)","v":"Five Pair Outgoing Contacts. Single Stack"}]
["BS142, IEC225, ESI48-4 EB1/ES1, P15 (1975)"]
[{"$f":"VLOOKUP(Database!$A$75,Database!$A$76:$B$78,2,FALSE)","v":"Housed in a Size 2 Case"}]
[]
["Auxiliary Supply Voltage :"]
[{"$f":"VLOOKUP(Database!$B$18,Database!$A$19:$B$23,2,FALSE)","v":"24-27 Vac/Vdc"}]
["Standard Output Contacts :"]
[{"$f":"VLOOKUP(Database!$B$7,Database!$A$8:$B$16,2,FALSE)","v":"5 Normally Open (5M)"}]
[{"$f":"VLOOKUP(Database!$A$80,Database!$A$81:$E$88,2)","v":" "}]
[null,{"$f":"VLOOKUP(Database!$A$80,Database!$A$81:$E$88,3)","v":" "}]
[{"$f":"VLOOKUP(Database!$A$80,Database!$A$81:$E$88,4)","v":" "}]
[null,{"$f":"VLOOKUP(Database!$A$80,Database!$A$81:$E$88,5)","v":" "}]
[]
[]
[null,null,"External Documents"]
[]
["Outline Wrapper",null,":",{"$f":"VLOOKUP(Database!$F$56,Database!$F$57:$H$63,3,FALSE)","v":"GJ0025.SHEET.1"}]
["Customer Wiring Diagram",null,":",{"$f":"VLOOKUP(Database!$F$48,Database!$F$49:$H$54,2,FALSE)","v":"01MVAJ1411.SHEET.1"}]
[]
[]
[null,null,"Internal Documents"]
[]
["Test Specification",null,":","07MVAJ"]
["Case Assembly",null,":",{"$f":"VLOOKUP(Database!$F$38,Database!$F$39:$H$41,3,FALSE)","v":"GJ0414103"}]
["Reset Assembly",null,":",{"$f":"VLOOKUP(Database!$F$56,Database!$F$57:$H$63,2,FALSE)","v":"GJ0428022"}]
[]
{"$rows_left_out":26}
{"sheet":"BOM","index":4,"n_rows":83,"n_cols":12,"rows_kept":83,"cut":false,"hidden":false,"merged":[[0,1,0,5]]}
["PCS MATERIAL MASTER","Requirements Key(s) / # of digit in model number",null,null,null,null,"Requirements Keys","Attribute Keys","NUMBER","DESCRIPTION","Qty.","Qty. Required"]
[{"$f":"CONCATENATE(\"MVAJ14\",Configurator!$D$5,Configurator!$E$5,Configurator!$F$5,Configurator!$G$5,Configurator!$H$5)","v":"MVAJ14R1BA0001F"},7,9,10,11]
[null,{"$f":"MID($A$2,7,1)","v":"R"},null,null,null,null,{"$f":"B3","v":"R"},"J","GJ0414103","ASSY CASE MIDOS SIZE 2 (BLUE)",1,{"$f":"IF(G3=H3,K3,\"\")","v":""}]
[null,{"$f":"MID($A$2,7,1)","v":"R"},null,null,null,null,{"$f":"B4","v":"R"},"R","GJ0414103","ASSY CASE MIDOS SIZE 2 (GREY)",1,{"$f":"IF(G4=H4,K4,\"\")","v":1}]
[null,{"$f":"MID($A$2,7,1)","v":"R"},null,null,null,null,{"$f":"B5","v":"R"},"L","GJ0416111","ASSY MIDOS CASE SIZE 4 BLUE",1,""]
[null,{"$f":"MID($A$2,7,1)","v":"R"},null,null,null,null,{"$f":"B6","v":"R"},"T","GJ0416111","ASSY MIDOS CASE SIZE 4 GREY",1,{"$f":"IF(G6=H6,K6,\"\")","v":""}]
[null,{"$f":"MID($A$2,7,1)","v":"R"},{"$f":"MID($A$2,9,1)","v":"B"},{"$f":"MID($A$2,10,1)","v":"A"},null,null,{"$f":"CONCATENATE(B7,C7,D7)","v":"RBA"},"JBB","GJ0428037","ASSY COVER AND RESET",1,""]
[null,"R",{"$f":"MID($A$2,9,1)","v":"B"},{"$f":"MID($A$2,10,1)","v":"A"},null,null,{"$f":"CONCATENATE(B8,C8,D8)","v":"RBA"},"RBB","GJ0428037","ASSY COVER AND RESET",1,{"$f":"IF(G8=H8,K8,\"\")","v":""}]
[null,"R",{"$f":"MID($A$2,9,1)","v":"B"},{"$f":"MID($A$2,10,1)","v":"A"},null,null,{"$f":"CONCATENATE(B9,C9,D9)","v":"RBA"},"JBA","GJ0428022","ASSY COVER & RESET",1,""]
[null,"R","B","A",null,null,{"$f":"CONCATENATE(B10,C10,D10)","v":"RBA"},"RBA","GJ0428022","ASSY COVER & RESET",1,{"$f":"IF(G10=H10,K10,\"\")","v":1}]
[null,"R","B","A",null,null,"RBA","JBE","GJ0428022","ASSY COVER & RESET",1,""]
[null,"R","B","A",null,null,{"$f":"CONCATENATE(B12,C12,D12)","v":"RBA"},"RBE","GJ0428022","ASSY COVER & RESET",1,{"$f":"IF(G12=H12,K12,\"\")","v":""}]
[null,"R","B",null,null,null,{"$f":"CONCATENATE(B13,C13)","v":"RB"},"LE","GJ0428202","ASSY COVER & RESET SIZE 4",1,""]
[null,"R","B",null,null,null,{"$f":"CONCATENATE(B14,C14)","v":"RB"},"TE","GJ0428202","ASSY COVER & RESET SIZE 4",1,{"$f":"IF(G14=H14,K14,\"\")","v":""}]
[null,"R","B","A",null,null,"RBA","LGA","GJ0428202","ASSY COVER & RESET SIZE 4",1,""]
[null,"R","B","A",null,null,{"$f":"CONCATENATE(B16,C16,D16)","v":"RBA"},"TGA","GJ0428202","ASSY COVER & RESET SIZE 4",1,{"$f":"IF(G16=H16,K16,\"\")","v":""}]
[null,"R","B","A",null,null,"RBA","LGB","GJ0428206","ASSY COVER AND RESET",1,""]
[null,"R","B","A",null,null,{"$f":"CONCATENATE(B18,C18,D18)","v":"RBA"},"TGB","GJ0428206","ASSY COVER AND RESET",1,{"$f":"IF(G18=H18,K18,\"\")","v":""}]
[null,"R","B","A",null,null,"RBA","LGE","GJ0428202","ASSY COVER & RESET SIZE 4",1,""]
[null,"R","B","A",null,null,{"$f":"CONCATENATE(B20,C20,D20)","v":"RBA"},"TGE","GJ0428202","ASSY COVER & RESET SIZE 4",1,{"$f":"IF(G20=H20,K20,\"\")","v":""}]
[null,null,"B",null,{"$f":"MID($A$2,11,1)","v":"0"},null,{"$f":"CONCATENATE(C21,E21)","v":"B0"},"G1","02MVAJ14002 SHT 1","INT WIRING DIAGRAM",1,""]
[null,null,"B",null,"0",null,"B0","G0","02MVAJ14002 SHT 2","INT WIRING DIAGRAM",1,""]
[null,null,"B",null,"0",null,"B0","E1","02MVAJ1403 SHT 1","INT WIRING DIAGRAM",1,""]
[null,null,"B",null,"0",null,"B0","E0","02MVAJ1403 SHT 2","INT WIRING DIAGRAM",1,""]
[null,null,"B",null,"0",null,"B0","B1","02MVAJ1410 SHT 1","INT WIRING DIAGRAM",1,""]
[null,null,"B",null,"0",null,"B0","B0","02MVAJ1411 SHT 1","INT WIRING DIAGRAM",1,1]
[null,{"$f":"MID($A$2,7,1)","v":"R"},null,null,null,null,{"$f":"B27","v":"R"},"J","GJ0013003","TERMINAL BLOCK ASSY MODULE",1,""]
[null,"R",null,null,null,null,{"$f":"B28","v":"R"},"R","GJ0013003","TERMINAL BLOCK ASSY MODULE",1,{"$f":"IF(G28=H28,K28,\"\")","v":1}]
[null,"R",null,null,null,null,"R","L","GJ0013008","TERMINAL BLOCK ASSY MODULE",1,""]
[null,"R",null,null,null,null,{"$f":"B30","v":"R"},"T","GJ0013008","TERMINAL BLOCK ASSY MODULE",1,{"$f":"IF(G30=H30,K30,\"\")","v":""}]
{"$rows_left_out":54}
{"sheet":"Database","index":5,"n_rows":101,"n_cols":12,"rows_kept":101,"cut":false,"hidden":true,"merged":[]}
[]
[null,1]
[1,{"$f":"HLOOKUP('Date Drivers'!$B$1,'Date Drivers'!$B$2:$C$103,2)","v":"Five"},{"$f":"HLOOKUP('Date Drivers'!$B$1,'Date Drivers'!$B$2:$C$103,5)","v":"B"},"Without Flag Indicator","With Hand Reset Flag Indicator","With Self Reset Flag Indicator","A","B","E"]
[2,{"$f":"HLOOKUP('Date Drivers'!$B$1,'Date Drivers'!$B$2:$C$103,3)","v":"Eight"},{"$f":"HLOOKUP('Date Drivers'!$B$1,'Date Drivers'!$B$2:$C$103,6)","v":"E"},"With Self Reset Flag Indicator"," "," ","E","E","E"]
[3,{"$f":"HLOOKUP('Date Drivers'!$B$1,'Date Drivers'!$B$2:$C$103,4)","v":"Ten"},{"$f":"HLOOKUP('Date Drivers'!$B$1,'Date Drivers'!$B$2:$C$103,7)","v":"G"},"Without Flag Indicator","With Hand Reset Flag Indicator","With Self Reset Flag Indicator","A","B","E"]
[null,null,null,null,null,null,null,null,{"$f":"Configurator!E14","v":1}]
[null,1,null,{"$f":"B2","v":1},null,null,null,null,1,"0001"]
[1,{"$f":"HLOOKUP('Date Drivers'!$B$1,'Date Drivers'!$B$2:$C$103,8)","v":"5 Normally Open (5M)"},{"$f":"HLOOKUP('Date Drivers'!$B$1,'Date Drivers'!$B$2:$C$103,17)","v":"0001"},1,2,3,null,null,2,"0002"]
[2,{"$f":"HLOOKUP('Date Drivers'!$B$1,'Date Drivers'!$B$2:$C$103,9)","v":"4 Normally Open + 1 Normally Closed (4M + 1B)"},{"$f":"HLOOKUP('Date Drivers'!$B$1,'Date Drivers'!$B$2:$C$103,18)","v":"0002"},"5 Normally Open (5M)","6 Normally Open + 2 Normally Closed (6M + 2B)","10 Normally Open (10M)",null,null,4,"0004"]
[3,{"$f":"HLOOKUP('Date Drivers'!$B$1,'Date Drivers'!$B$2:$C$103,10)","v":"3 Normally Open + 2 Normally Closed (3M + 2B)"},{"$f":"HLOOKUP('Date Drivers'!$B$1,'Date Drivers'!$B$2:$C$103,19)","v":"0004"},"4 Normally Open + 1 Normally Closed (4M + 1B)","5 Normally Open + 3 Normally Closed (5M + 3B)","9 Normally Open + 1 Normally Closed (9M + 1B)",null,null,6,"0006"]
[4,{"$f":"HLOOKUP('Date Drivers'!$B$1,'Date Drivers'!$B$2:$C$103,11)","v":"2 Normally Open + 3 Normally Closed (2M + 3B)"},{"$f":"HLOOKUP('Date Drivers'!$B$1,'Date Drivers'!$B$2:$C$103,20)","v":"0006"},"3 Normally Open + 2 Normally Closed (3M + 2B)","4 Normally Open + 4 Normally Closed (4M + 4B)","8 Normally Open + 2 Normally Closed (8M + 2B)",null,null,8,"0008"]
[5,{"$f":"HLOOKUP('Date Drivers'!$B$1,'Date Drivers'!$B$2:$C$103,12)","v":"1 Normally Open + 4 Normally Closed (1M + 4B)"},{"$f":"HLOOKUP('Date Drivers'!$B$1,'Date Drivers'!$B$2:$C$103,21)","v":"0008"},"2 Normally Open + 3 Normally Closed (2M + 3B)"," ","7 Normally Open + 3 Normally Closed (7M + 3B)",null,null,11,"0011"]
[6,{"$f":"HLOOKUP('Date Drivers'!$B$1,'Date Drivers'!$B$2:$C$103,13)","v":"5 Normally Closed (5B)"},{"$f":"HLOOKUP('Date Drivers'!$B$1,'Date Drivers'!$B$2:$C$103,22)","v":"0011"},"1 Normally Open + 4 Normally Closed (1M + 4B)"," ","6 Normally Open + 4 Normally Closed (6M + 4B)",null,null,21,"0021"]
[7,{"$f":"HLOOKUP('Date Drivers'!$B$1,'Date Drivers'!$B$2:$C$103,14)","v":" "},{"$f":"HLOOKUP('Date Drivers'!$B$1,'Date Drivers'!$B$2:$C$103,23)","v":"0011"},"5 Normally Closed (5B)"," ","5 Normally Open + 5 Normally Closed (5M + 5B)",null,null,22,"0022"]
[8,{"$f":"HLOOKUP('Date Drivers'!$B$1,'Date Drivers'!$B$2:$C$103,15)","v":" "},{"$f":"HLOOKUP('Date Drivers'!$B$1,'Date Drivers'!$B$2:$C$103,24)","v":"0011"}," "," ","4 Normally Open + 6 Normally Closed (4M + 6B)",null,null,24,"0024"]
[9,{"$f":"HLOOKUP('Date Drivers'!$B$1,'Date Drivers'!$B$2:$C$103,16)","v":" "},{"$f":"HLOOKUP('Date Drivers'!$B$1,'Date Drivers'!$B$2:$C$103,25)","v":"0011"}," "," ","3 Normally Open + 7 Normally Closed (3M + 7B)",null,null,27,"0027",null,""]
[null,null,null," "," ","2 Normally Open + 8 Normally Closed (2M + 8B)",null,null,30,"0030"]
[null,1,null,"0001","0032","0021",null,null,33,"0033"]
[1,{"$f":"HLOOKUP('Date Drivers'!$B$1,'Date Drivers'!$B$2:$C$103,26)","v":"24-27 Vac/Vdc"},{"$f":"HLOOKUP('Date Drivers'!$B$1,'Date Drivers'!$B$2:$C$103,31)","v":"0000"},"0002","0035","0022",null,null,36,"0036"]
[2,{"$f":"HLOOKUP('Date Drivers'!$B$1,'Date Drivers'!$B$2:$C$103,27)","v":"30-34 Vac/Vdc"},{"$f":"HLOOKUP('Date Drivers'!$B$1,'Date Drivers'!$B$2:$C$103,32)","v":"0250"},"0004","0038","0024",null,null,39,"0039"]
[3,{"$f":"HLOOKUP('Date Drivers'!$B$1,'Date Drivers'!$B$2:$C$103,28)","v":"48-54 Vac/Vdc"},{"$f":"HLOOKUP('Date Drivers'!$B$1,'Date Drivers'!$B$2:$C$103,33)","v":"0500"},"0006","0038","0027",null,null,42,"0042"]
[4,{"$f":"HLOOKUP('Date Drivers'!$B$1,'Date Drivers'!$B$2:$C$103,29)","v":"110-125 Vac/Vdc"},{"$f":"HLOOKUP('Date Drivers'!$B$1,'Date Drivers'!$B$2:$C$103,34)","v":"0750"},"0008","0038","0030",null,null,48,"0048"]
[5,{"$f":"HLOOKUP('Date Drivers'!$B$1,'Date Drivers'!$B$2:$C$103,30)","v":"220-250 Vac/Vdc"},{"$f":"HLOOKUP('Date Drivers'!$B$1,'Date Drivers'!$B$2:$C$103,35)","v":"1000"},"0011","0038","0033",null,null,49,"0049"]
[null,null,null,"0011","0038","0036",null,null,251,"0251"]
[null,1,null,"0011","0038","0039",null,null,252,"0252"]
[1,{"$f":"HLOOKUP('Date Drivers'!$B$1,'Date Drivers'!$B$2:$C$103,36)","v":"Without Flag Indicator"},{"$f":"HLOOKUP('Date Drivers'!$B$1,'Date Drivers'!$B$2:$C$103,39)","v":"A"},"0011","0038","0042",null,null,254,"0254"]
[2,{"$f":"HLOOKUP('Date Drivers'!$B$1,'Date Drivers'!$B$2:$C$103,37)","v":"With Hand Reset Flag Indicator"},{"$f":"HLOOKUP('Date Drivers'!$B$1,'Date Drivers'!$B$2:$C$103,40)","v":"B"},null,null,null,null,null,256,"0256"]
[3,{"$f":"HLOOKUP('Date Drivers'!$B$1,'Date Drivers'!$B$2:$C$103,38)","v":"With Self Reset Flag Indicator"},{"$f":"HLOOKUP('Date Drivers'!$B$1,'Date Drivers'!$B$2:$C$103,41)","v":"E"},null,null,null,null,null,258,"0258"]
[null,{"$f":"B2*10+B7","v":11},null,null,null,{"$f":"CONCATENATE(Configurator!$E$5,Configurator!$F$5)","v":"BA"},"Auxiliary Unit",null,261,"0261"]
[null,11,21,31,null,"BA","FB0307029","A",271,"0271"]
{"$rows_left_out":72}
{"sheet":"Aux Units","index":6,"n_rows":248,"n_cols":3,"rows_kept":248,"cut":false,"hidden":true,"merged":[]}
["Aux Unit",{"$f":"VLOOKUP(Database!$F$29,Database!$F$30:$G$36,2,FALSE)","v":"FB0307029"},{"$f":"VLOOKUP(Database!$F$29,Database!$F$30:$H$36,3,FALSE)","v":"A"}]
["Flag",{"$f":"VLOOKUP(Database!$F$43,Database!$F$44:$G$46,2,FALSE)","v":"FB0295020"},{"$f":"VLOOKUP(Database!$F$43,Database!$F$44:$H$46,3,FALSE)","v":"A"}]
["Coil",{"$f":"VLOOKUP(Database!$A$60,Database!$A$61:$E$73,2,FALSE)","v":"ZC0228027"},{"$f":"VLOOKUP(Database!$A$60,Database!$A$61:$E$73,3,FALSE)","v":"H"}]
["Contacts",{"$f":"VLOOKUP(Database!$D$42,Database!$C$43:$D$60,2)","v":"FB0317006"},{"$f":"VLOOKUP(Database!$D$42,Database!$C$43:$E$60,3)","v":"01"}]
["2nd Aux Unit",{"$f":"VLOOKUP(Database!$A$60,Database!$A$61:$E$73,4,FALSE)","v":"FB0247478.24"}]
["New Aux Unit.Suffix (If Req'd)->",null,{"$f":"CONCATENATE($B$1,\".   \")","v":"FB0307029.   "}]
[]
["Copy From      -------------->",null,{"$f":"C6","v":"FB0307029.   "}]
[]
[]
[]
[{"$f":"CONCATENATE($C$1,$C$2,$C$3,$C$4)","v":"AAH01"},{"$f":"VLOOKUP(A12,$A$15:$C$614,2,FALSE)","v":"FB0307029.28"},{"$f":"VLOOKUP(A12,$A$15:$C$614,3,FALSE)","v":"AUX(coil ZC0228027)5M CUT OFF"}]
[]
["Lookup Table"]
["AAB01","FB0307029.???","See Below"]
["AAB02","FB0307029.???","See Below"]
["AAB03","FB0307029.15","AUX COIL ZC0228013/012 3M2B  1B CUT OFF"]
["AAB04","FB0307029.???","See Below"]
["AAB05","FB0307029.???","See Below"]
["AAB06","FB0307029.???","See Below"]
["AAC01","FB0307029.23","AUX RELAY (coil ZC0228014)5M 1B CUT OFF"]
["AAC02","FB0307029.03","AUX (coil ZC0228014/12)4M 1B, 1B CUT OFF"]
["AAC03","FB0307029.???","See Below"]
["AAC04","FB0307029.08","AUX RELAY(coil ZC0228014)3B 2M 1B C/OFF"]
["AAC05","FB0307029.???","See Below"]
["AAC06","FB0307029.???","See Below"]
["AAE01","FB0307029.???","See Below"]
["AAE02","FB0307029.???","See Below"]
["AAE03","FB0307029.???","See Below"]
["AAE04","FB0307029.???","See Below"]
{"$rows_left_out":219}
{"sheet":"Date Drivers","index":7,"n_rows":44,"n_cols":3,"rows_kept":44,"cut":false,"hidden":true,"merged":[]}
["Key Date",{"$f":"IF(Configurator!$A$3=\"\",TODAY(),Configurator!$A$3)","v":"2025-08-18"}]
[null,"2004-01-05","2004-11-01"]
["Number of Contacts","Five","Five"]
[null,"Eight","Eight"]
[null,"Ten","Ten"]
[null,"B","B"]
[null,"E","E"]
[null,"G","G"]
["Contact Combination",{"$f":"HLOOKUP(Database!$D$7,Database!$D$8:$H$28,2)","v":"5 Normally Open (5M)"},{"$f":"HLOOKUP(Database!$D$7,Database!$D$8:$H$28,2)","v":"5 Normally Open (5M)"}]
[null,{"$f":"HLOOKUP(Database!$D$7,Database!$D$8:$H$28,3)","v":"4 Normally Open + 1 Normally Closed (4M + 1B)"},{"$f":"HLOOKUP(Database!$D$7,Database!$D$8:$H$28,3)","v":"4 Normally Open + 1 Normally Closed (4M + 1B)"}]
[null,{"$f":"HLOOKUP(Database!$D$7,Database!$D$8:$H$28,4)","v":"3 Normally Open + 2 Normally Closed (3M + 2B)"},{"$f":"HLOOKUP(Database!$D$7,Database!$D$8:$H$28,4)","v":"3 Normally Open + 2 Normally Closed (3M + 2B)"}]
[null,{"$f":"HLOOKUP(Database!$D$7,Database!$D$8:$H$28,5)","v":"2 Normally Open + 3 Normally Closed (2M + 3B)"},{"$f":"HLOOKUP(Database!$D$7,Database!$D$8:$H$28,5)","v":"2 Normally Open + 3 Normally Closed (2M + 3B)"}]
[null,{"$f":"HLOOKUP(Database!$D$7,Database!$D$8:$H$28,6)","v":"1 Normally Open + 4 Normally Closed (1M + 4B)"},{"$f":"HLOOKUP(Database!$D$7,Database!$D$8:$H$28,6)","v":"1 Normally Open + 4 Normally Closed (1M + 4B)"}]
[null,{"$f":"HLOOKUP(Database!$D$7,Database!$D$8:$H$28,7)","v":"5 Normally Closed (5B)"},{"$f":"HLOOKUP(Database!$D$7,Database!$D$8:$H$28,7)","v":"5 Normally Closed (5B)"}]
[null,{"$f":"HLOOKUP(Database!$D$7,Database!$D$8:$H$28,8)","v":" "},{"$f":"HLOOKUP(Database!$D$7,Database!$D$8:$H$28,8)","v":" "}]
[null,{"$f":"HLOOKUP(Database!$D$7,Database!$D$8:$H$28,9)","v":" "},{"$f":"HLOOKUP(Database!$D$7,Database!$D$8:$H$28,9)","v":" "}]
[null,{"$f":"HLOOKUP(Database!$D$7,Database!$D$8:$H$28,10)","v":" "},{"$f":"HLOOKUP(Database!$D$7,Database!$D$8:$H$28,10)","v":" "}]
[null,{"$f":"HLOOKUP(Database!$D$7,Database!$D$8:$H$28,11)","v":"0001"},{"$f":"HLOOKUP(Database!$D$7,Database!$D$8:$H$28,11)","v":"0001"}]
[null,{"$f":"HLOOKUP(Database!$D$7,Database!$D$8:$H$28,12)","v":"0002"},{"$f":"HLOOKUP(Database!$D$7,Database!$D$8:$H$28,12)","v":"0002"}]
[null,{"$f":"HLOOKUP(Database!$D$7,Database!$D$8:$H$28,13)","v":"0004"},{"$f":"HLOOKUP(Database!$D$7,Database!$D$8:$H$28,13)","v":"0004"}]
[null,{"$f":"HLOOKUP(Database!$D$7,Database!$D$8:$H$28,14)","v":"0006"},{"$f":"HLOOKUP(Database!$D$7,Database!$D$8:$H$28,14)","v":"0006"}]
[null,{"$f":"HLOOKUP(Database!$D$7,Database!$D$8:$H$28,15)","v":"0008"},{"$f":"HLOOKUP(Database!$D$7,Database!$D$8:$H$28,15)","v":"0008"}]
[null,{"$f":"HLOOKUP(Database!$D$7,Database!$D$8:$H$28,16)","v":"0011"},{"$f":"HLOOKUP(Database!$D$7,Database!$D$8:$H$28,16)","v":"0011"}]
[null,{"$f":"HLOOKUP(Database!$D$7,Database!$D$8:$H$28,17)","v":"0011"},{"$f":"HLOOKUP(Database!$D$7,Database!$D$8:$H$28,17)","v":"0011"}]
[null,{"$f":"HLOOKUP(Database!$D$7,Database!$D$8:$H$28,18)","v":"0011"},{"$f":"HLOOKUP(Database!$D$7,Database!$D$8:$H$28,18)","v":"0011"}]
[null,{"$f":"HLOOKUP(Database!$D$7,Database!$D$8:$H$28,19)","v":"0011"},{"$f":"HLOOKUP(Database!$D$7,Database!$D$8:$H$28,19)","v":"0011"}]
["Voltage Rating",{"$f":"HLOOKUP(Database!$B$29,Database!$B$30:$D$41,2)","v":"24-27 Vac/Vdc"},{"$f":"HLOOKUP(Database!$B$29,Database!$B$30:$D$41,2)","v":"24-27 Vac/Vdc"}]
[null,{"$f":"HLOOKUP(Database!$B$29,Database!$B$30:$D$41,3)","v":"30-34 Vac/Vdc"},{"$f":"HLOOKUP(Database!$B$29,Database!$B$30:$D$41,3)","v":"30-34 Vac/Vdc"}]
[null,{"$f":"HLOOKUP(Database!$B$29,Database!$B$30:$D$41,4)","v":"48-54 Vac/Vdc"},{"$f":"HLOOKUP(Database!$B$29,Database!$B$30:$D$41,4)","v":"48-54 Vac/Vdc"}]
[null,{"$f":"HLOOKUP(Database!$B$29,Database!$B$30:$D$41,5)","v":"110-125 Vac/Vdc"},{"$f":"HLOOKUP(Database!$B$29,Database!$B$30:$D$41,5)","v":"110-125 Vac/Vdc"}]
{"$rows_left_out":15}
{"sheet":"Routing","index":8,"n_rows":14,"n_cols":5,"rows_kept":14,"cut":false,"hidden":true,"merged":[]}
[]
[null,"Model No:",{"$f":"BOM!A2","v":"MVAJ14R1BA0001F"}]
[null,"Ref Op Set: "]
[null,"Pre-production Ref Op. Set: "]
[null,{"$f":"'Routing DB'!$D$17","v":"Delete Flash Test Op"}]
[]
[null,"105BA","Assembly & Wire",{"$f":"'Routing DB'!B16","v":17},"Mins"]
[null,"105BB","Product Check",6,"Mins"]
[null,"105BC","Prep for Test",{"$f":"'Routing DB'!H16","v":{"$error":"#N/A"}},"Mins"]
[null,"105DB","Flash Test",{"$f":"'Routing DB'!E7","v":0},"Mins"]
[null,"105DB","Test",{"$f":"'Routing DB'!H8","v":2.2999999999999998},"Mins"]
[null,"106BN","Nameplate Printing",{"$f":"'Routing DB'!E15","v":{"$error":"#N/A"}},"Mins"]
[null,"105BQ","Final Inspection",2,"Mins"]
[null,"105BP","Pack",6.5,"Mins"]

{"sheet":"Routing DB","index":9,"n_rows":36,"n_cols":8,"rows_kept":36,"cut":false,"hidden":true,"merged":[]}
["Assy/Wire",null,null,"Flash Test",null,null,"Test"]
[{"$f":"Configurator!$D$10","v":"B"},{"$f":"VLOOKUP($A$2,$A$3:$B$5,2,FALSE)","v":17},null,{"$f":"Configurator!$D$10","v":"B"},{"$f":"VLOOKUP($D$2,$D$3:$E$5,2,FALSE)","v":0},null,{"$f":"Configurator!$F$5","v":"A"},{"$f":"VLOOKUP($G$2,$G$3:$H$7,2,FALSE)","v":2.2999999999999998}]
["B",17,null,"B",0,null,"A",2.2999999999999998]
["D",60.5,null,"D",5,null,"B",3.2]
["G",68.099999999999994,null,"G",0,null,"C",2.2999999999999998]
[null,null,null,null,null,null,"D",3.2]
[{"$f":"Configurator!G5","v":"0001"},null,null,"Flash Test Time",{"$f":"$E$2","v":0}]
[{"$f":"MID(A7,1,2)","v":"00"},{"$f":"VLOOKUP($A$8,$A$9:$B$14,2,FALSE)","v":0},null,null,null,null,"Test Time",{"$f":"$H$2","v":2.2999999999999998}]
["00",0,null,"Nameplate Print"]
["02",0,null,{"$f":"Configurator!$F$5","v":"A"},{"$f":"VLOOKUP($D$10,$D$11:$E$13,2,FALSE)","v":{"$error":"#N/A"}},null,"Prep for Test"]
["05",0,null,"B",0.6,null,{"$f":"Configurator!$F$5","v":"A"},{"$f":"VLOOKUP($G$11,$G$12:$H$14,2,FALSE)","v":{"$error":"#N/A"}}]
["07",0,null,"D",1.8,null,"B",5.2]
["10",{"$f":"IF(A2=\"B\",2,5.3)","v":2},null,"G",1.8,null,"D",10.3]
["90",0,null,null,null,null,"G",10.3]
[null,null,null,"Test Time",{"$f":"E10","v":{"$error":"#N/A"}}]
["Total Assy/Wire Time",{"$f":"$B$2+$B$8","v":17},null,null,null,null,"Test Time",{"$f":"$H$11","v":{"$error":"#N/A"}}]
[null,null,null,{"$f":"IF(E7=0,\"Delete Flash Test Op\",\" \")","v":"Delete Flash Test Op"}]
[]
[]
["Workings"]
[]
["Ass&Wire"]
["5 Contacts",17]
["PLUS 220V",2]
["10 Contacts",68.099999999999994]
["PLUS 220V","5.3 ?","See Working Sheet for Query !"]
[]
["2 Std + 5 BOM Contacts",60.5,"Only 110V !"]
[]
["Flash Test"]
{"$rows_left_out":6}