{"text_format":"1","workbook":"xlsx","n_sheets":10,"sheets":["Disclaimer","CORTEC","Configurator","Master Text","BOM","Database","Aux Units","Date Drivers","Routing","Routing DB"],"not_rendered":{"charts":0,"images":0,"macros":1,"external_links":0,"defined_names":12,"comments":0,"pivot_tables":0},"unopened":[],"bounds":{"document_bytes":16777216,"sheet_cells":100000,"rows_first":2000,"rows_last":500,"rows_between":2000,"halvings":0,"cell_chars":16384,"cell_head_chars":4096},"cells_cut":0,"cells_raw":0,"read":"whole","date_system":"1900"}

{"sheet":"Disclaimer","index":0,"n_rows":6,"n_cols":2,"rows_kept":6,"cut":false,"hidden":false,"merged":[[2,1,2,9],[5,1,7,9],[3,1,4,9]]}
["THIS PRODUCT IS NOW OBSOLETE"]
[]
[null,"Our policy is one of continuous development. Accordingly the design of our products may change at any time. "]
[null,"Whilst every effort is made to produce up to date literature, this document should only be regarded as a guide and is intended for information purposes only."]
[]
[null,"Its contents do not constitute an offer for sale or advice on the application of any product referred to in it. We cannot be held responsible for any reliance on any decisions taken on its contents without specific advice."]

{"sheet":"CORTEC","index":1,"n_rows":52,"n_cols":14,"rows_kept":52,"cut":false,"hidden":false,"merged":[]}
["Ordering information"]
["THIS PRODUCT IS NOW OBSOLETE"]
["Variants Order No.     "]
["Low Burden Electrical Reset Tripping Relay with Instantaneous Cut Off",null,null,null,"MVAJ14",null,1,null,null,null,null,null,null,"A"]
["Case"]
["Housed in a size 2 Case (5 Contact Option Only)",null,"Blue case/Grey cover",null,null,"J"]
[null,null,"Grey case/Grey cover",null,null,"R"]
["Housed in a size 4 Case (8 & 10 Contact Options Only)",null,"Blue case/Grey cover",null,null,"L"]
[null,null,"Grey case/Grey cover",null,null,"T"]
[]
["Number of Contacts"]
["Five Pair Outgoing Contacts",null,null,null,null,null,null,"B"]
["Eight Pair Outgoing Contacts ",null,null,null,null,null,null,"E"]
["Ten Pair Outgoing Contacts",null,null,null,null,null,null,"G"]
[]
["Flagging"]
["Without Flag Indicator",null,null,null,null,null,null,null,"A"]
["With Hand Reset Flag Indicator",null,null,null,null,null,null,null,"B"]
["With Self Reset Flag Indicator",null,null,null,null,null,null,null,"E"]
[]
["Voltage & Contact Combinations"]
["Voltage Options"]
["24/27 Vac/Vdc",null,null,null,null,null,null,null,null,0,0,0,0]
["30/34 Vac/Vdc",null,null,null,null,null,null,null,null,0,2,5,0]
["48/54 Vac/Vdc",null,null,null,null,null,null,null,null,0,5,0,0]
["110/125 Vac/Vdc",null,null,null,null,null,null,null,null,0,7,5,0]
["220/250 Vac/Vdc",null,null,null,null,null,null,null,null,1,0,0,0]
["Plus Contact Configuration Options"]
["5 Make (5M)",null,null,null,null,null,null,null,null,0,0,0,1]
["4 Make + 1 Break (4M+1B)",null,null,null,null,null,null,null,null,0,0,0,2]
["3 Make + 2 Break (3M+2B)",null,null,null,null,null,null,null,null,0,0,0,4]
["2 Make + 3 Break (2M+3B)",null,null,null,null,null,null,null,null,0,0,0,6]
["1 Make + 4 Break (1M+4B)",null,null,null,null,null,null,null,null,0,0,0,8]
["5 Break (5B)",null,null,null,null,null,null,null,null,0,0,1,1]
["6 Make + 2 Break (6M + 2B)",null,null,null,null,null,null,null,null,0,0,3,2]
["5 Make + 3 Break (5M + 3B)",null,null,null,null,null,null,null,null,0,0,3,5]
["4 Make + 4 Break (4M + 4B)",null,null,null,null,null,null,null,null,0,0,3,8]
["10 Make (10M)",null,null,null,null,null,null,null,null,0,0,2,1]
["9 Make + 1 Break (9M+1B)",null,null,null,null,null,null,null,null,0,0,2,2]
["8 Make + 2 Break (8M+2B)",null,null,null,null,null,null,null,null,0,0,2,4]
["7 Make + 3 Break (7M+3B)",null,null,null,null,null,null,null,null,0,0,2,7]
["6 Make + 4 Break (6M+4B)",null,null,null,null,null,null,null,null,0,0,3,0]
["5 Make + 5 Break (5M+5B)",null,null,null,null,null,null,null,null,0,0,3,3]
["4 Make + 6 Break (4M+6B)",null,null,null,null,null,null,null,null,0,0,3,6]
["3 Make + 7 Break (3M+7B)",null,null,null,null,null,null,null,null,0,0,3,9]
["2 Make + 8 Break (2M+8B)",null,null,null,null,null,null,null,null,0,0,4,2]
[]
["Issue"]
["Factory Defined (5 Contact Options Only)",null,null,null,null,null,null,null,null,null,null,null,null,"F"]
["Factory Defined (8 Contact Options Only)",null,null,null,null,null,null,null,null,null,null,null,null,"B"]
["Factory Defined (10 Contact Options Only, without flag or with hand reset flag indicator)",null,null,null,null,null,null,null,null,null,null,null,null,"B"]
["Factory Defined (10 Contact Options Only, with self reset flag indicator)",null,null,null,null,null,null,null,null,null,null,null,null,"A"]

{"sheet":"Configurator","index":2,"n_rows":18,"n_cols":8,"rows_kept":18,"cut":false,"hidden":false,"merged":[[4,0,4,2],[3,1,3,2],[13,4,15,4]]}
["Electrical Reset Contacts with Instantaneous Cut Off Low Burden Tripping Relay - MVAJ14"]
["THIS PRODUCT IS NOW OBSOLETE"]
[null,"Format = dd/mm/yyy (where d=day, m=month, y=year)"]
[null,"1 - 6   ",null,"7 - 8",9,10,"11-14",15]
["PCS     VARIANT                   MVAJ14",null,null,{"$f":"D8","v":"R1"},{"$f":"$D$10","v":"B"},{"$f":"D12","v":"A"},{"$f":"VLOOKUP(Database!$I$6,Database!$I$7:$J$101,2,FALSE)","v":"0001"},{"$f":"$D$18","v":"F"}]
[null,null,null,{"$f":"#REF!","v":{"$error":"#REF!"}},{"$f":"#REF!","v":{"$error":"#REF!"}},{"$f":"VLOOKUP(#REF!,#REF!,4)","v":{"$error":"#REF!"}},{"$f":"#REF!","v":{"$error":"#REF!"}},{"$f":"VLOOKUP(#REF!,#REF!,3)","v":{"$error":"#REF!"}}]
["Case Size and Mounting (Dependant on Number of Contacts)"]
[{"$f":"VLOOKUP(Database!$A$75,Database!$A$76:$C$78,2,FALSE)","v":"Housed in a Size 2 Case"},null,null,{"$f":"VLOOKUP(Database!$A$75,Database!$A$76:$C$78,3,FALSE)","v":"R1"}]
["Number of Contacts"]
[null,null,null,{"$f":"VLOOKUP(Database!$B$2,Database!$A$3:$C$5,3,FALSE)","v":"B"}]
["Flagging"]
[null,null,null,{"$f":"VLOOKUP(Database!$B$25,Database!$A$26:$C$28,3,FALSE)","v":"A"}]
["Contact Combination"]
[null,null,null,{"$f":"VLOOKUP(Database!$B$7,Database!$A$8:$C$16,3,FALSE)","v":"0001"},{"$f":"D14+D16","v":1}]
["Voltage Rating",null,null,"plus"]
[null,null,null,{"$f":"VLOOKUP(Database!$B$18,Database!$A$19:$C$23,3,FALSE)","v":"0000"}]
["Issue"]
[null,null,null,{"$f":"VLOOKUP(Database!$E$65,Database!$E$66:$F$72,2,FALSE)","v":"F"}]

{"sheet":"Master Text","index":3,"n_rows":55,"n_cols":4,"rows_kept":55,"cut":false,"hidden":false,"merged":[]}
["THIS PRODUCT IS NOW OBSOLETE"]
[{"$f":"BOM!A2","v":"MVAJ14R1BA0001F"}]
["Low Burden Electrically Reset Control Relay"]
[{"$f":"CONCATENATE(\"With Instantaneous Cut Off \",VLOOKUP(Database!$B$25,Database!$A$26:$B$28,2,FALSE))","v":"With Instantaneous Cut Off Without Flag Indicator"}]
[{"$f":"VLOOKUP(Database!$F$38,Database!$F$39:$G$41,2,FALSE)","v":"Five Pair Outgoing Contacts. Single Stack"}]
["BS142, IEC225, ESI48-4 EB1/ES1, P15 (1975)"]
[{"$f":"VLOOKUP(Database!$A$75,Database!$A$76:$B$78,2,FALSE)","v":"Housed in a Size 2 Case"}]
[]
["Auxiliary Supply Voltage :"]
[{"$f":"VLOOKUP(Database!$B$18,Database!$A$19:$B$23,2,FALSE)","v":"24-27 Vac/Vdc"}]
["Standard Output Contacts :"]
[{"$f":"VLOOKUP(Database!$B$7,Database!$A$8:$B$16,2,FALSE)","v":"5 Normally Open (5M)"}]
[{"$f":"VLOOKUP(Database!$A$80,Database!$A$81:$E$88,2)","v":" "}]
[null,{"$f":"VLOOKUP(Database!$A$80,Database!$A$81:$E$88,3)","v":" "}]
[{"$f":"VLOOKUP(Database!$A$80,Database!$A$81:$E$88,4)","v":" "}]
[null,{"$f":"VLOOKUP(Database!$A$80,Database!$A$81:$E$88,5)","v":" "}]
[]
[]
[null,null,"External Documents"]
[]
["Outline Wrapper",null,":",{"$f":"VLOOKUP(Database!$F$56,Database!$F$57:$H$63,3,FALSE)","v":"GJ0025.SHEET.1"}]
["Customer Wiring Diagram",null,":",{"$f":"VLOOKUP(Database!$F$48,Database!$F$49:$H$54,2,FALSE)","v":"01MVAJ1411.SHEET.1"}]
[]
[]
[null,null,"Internal Documents"]
[]
["Test Specification",null,":","07MVAJ"]
["Case Assembly",null,":",{"$f":"VLOOKUP(Database!$F$38,Database!$F$39:$H$41,3,FALSE)","v":"GJ0414103"}]
["Reset Assembly",null,":",{"$f":"VLOOKUP(Database!$F$56,Database!$F$57:$H$63,2,FALSE)","v":"GJ0428022"}]
[]
[]
["Issue"]
["Version :",null,"A","Original - 10/02/2004"]
[null,null,"B","Resistor text added to Master Text sheet where applicable - 03/05/04"]
[null,null,"C","FB0307006.32 added to Aux Units for MVAJ14T1GE0786A - 27/10/08"]
[null,null,"D","FB0307005.03 added to Aux Units for MVAJ14R1BE0004F - 23/12/08"]
[null,null,"E","FB0307029.23 added to Aux Units for MVAJ14R1BA0751F - 30/09/09"]
[null,null,"F","FB0307025.165 added to Aux Units for MVAJ14T1GB1021B - 22/02/10"]
[null,null,"G","FB0307006.34 added to Aux Units for MVAJ14T1GE0783A - 15/07/10"]
[null,null,"H","References to Alstom and Areva removed - 30/09/10"]
[null,null,"I","FB0307025.139 added to Aux Units for MVAJ14T1GB0771B - 14/10/11"]
[null,null,"J","FB0307029.26 added to Aux Units for MVAJ14R1BA0254F - 02/08/2014"]
[null,null,"K","FB0307006.38 added to Aux Units for MVAJ14R1GE0283A - 17/10/2014"]
[null,null,"L","FB0307006.39 added to Aux Units for MVAJ14R1GE0772A - 30/01/2015"]
[null,null,"M","ZC0228017 replaced ZC0228016 for MVAA14T1G*07xxx variants - following Production issues - 02/03/2015"]
[null,null,"N","FB0307026.65 added to Aux Units for MVAJ14T1GA0772B - 02/06/2015"]
[null,null,"O","FB0307025.173 added to Aux Units for MVAJ14T1GB0033B - 22/06/2015"]
[null,null,"P","FB0307025.176 added to Aux Units for MVAJ14T1GB1022B - 19/02/2020"]
[null,null,"Q","FB0307006.40 added to Aux Units for MVAJ14T1GE0774 - 02/07/2020"]
[null,null,"R","FB0307024.34 added to Aux Units for MVAJ14T1BB0502F - 17/08/2020"]
[null,null,"S","FB0307025.177 added to Aux Units for MVAJ14T1GB0274B - 17/06/2021"]
[null,null,"T","FB0307029.28 added to Aux Units for MVAJ14T1BA0001F - 19/07/2021"]
[null,null,"U","FB0307026.68 added to Aux Units for MVAJ14T1GA0771B - 26/09/2022"]
[null,null,"V","FB0307006.41 added to Aux Units for MVAJ14T1GE0771B - 17/04/2024"]
[null,null,"W","Product withdrawn by GER-4964/CID008976; revised for GE Vernova guidelines - 18/08/2025"]

{"sheet":"BOM","index":4,"n_rows":83,"n_cols":12,"rows_kept":83,"cut":false,"hidden":false,"merged":[[0,1,0,5]]}
["PCS MATERIAL MASTER","Requirements Key(s) / # of digit in model number",null,null,null,null,"Requirements Keys","Attribute Keys","NUMBER","DESCRIPTION","Qty.","Qty. Required"]
[{"$f":"CONCATENATE(\"MVAJ14\",Configurator!$D$5,Configurator!$E$5,Configurator!$F$5,Configurator!$G$5,Configurator!$H$5)","v":"MVAJ14R1BA0001F"},7,9,10,11]
[null,{"$f":"MID($A$2,7,1)","v":"R"},null,null,null,null,{"$f":"B3","v":"R"},"J","GJ0414103","ASSY CASE MIDOS SIZE 2 (BLUE)",1,{"$f":"IF(G3=H3,K3,\"\")","v":""}]
[null,{"$f":"MID($A$2,7,1)","v":"R"},null,null,null,null,{"$f":"B4","v":"R"},"R","GJ0414103","ASSY CASE MIDOS SIZE 2 (GREY)",1,{"$f":"IF(G4=H4,K4,\"\")","v":1}]
[null,{"$f":"MID($A$2,7,1)","v":"R"},null,null,null,null,{"$f":"B5","v":"R"},"L","GJ0416111","ASSY MIDOS CASE SIZE 4 BLUE",1,""]
[null,{"$f":"MID($A$2,7,1)","v":"R"},null,null,null,null,{"$f":"B6","v":"R"},"T","GJ0416111","ASSY MIDOS CASE SIZE 4 GREY",1,{"$f":"IF(G6=H6,K6,\"\")","v":""}]
[null,{"$f":"MID($A$2,7,1)","v":"R"},{"$f":"MID($A$2,9,1)","v":"B"},{"$f":"MID($A$2,10,1)","v":"A"},null,null,{"$f":"CONCATENATE(B7,C7,D7)","v":"RBA"},"JBB","GJ0428037","ASSY COVER AND RESET",1,""]
[null,"R",{"$f":"MID($A$2,9,1)","v":"B"},{"$f":"MID($A$2,10,1)","v":"A"},null,null,{"$f":"CONCATENATE(B8,C8,D8)","v":"RBA"},"RBB","GJ0428037","ASSY COVER AND RESET",1,{"$f":"IF(G8=H8,K8,\"\")","v":""}]
[null,"R",{"$f":"MID($A$2,9,1)","v":"B"},{"$f":"MID($A$2,10,1)","v":"A"},null,null,{"$f":"CONCATENATE(B9,C9,D9)","v":"RBA"},"JBA","GJ0428022","ASSY COVER & RESET",1,""]
[null,"R","B","A",null,null,{"$f":"CONCATENATE(B10,C10,D10)","v":"RBA"},"RBA","GJ0428022","ASSY COVER & RESET",1,{"$f":"IF(G10=H10,K10,\"\")","v":1}]
[null,"R","B","A",null,null,"RBA","JBE","GJ0428022","ASSY COVER & RESET",1,""]
[null,"R","B","A",null,null,{"$f":"CONCATENATE(B12,C12,D12)","v":"RBA"},"RBE","GJ0428022","ASSY COVER & RESET",1,{"$f":"IF(G12=H12,K12,\"\")","v":""}]
[null,"R","B",null,null,null,{"$f":"CONCATENATE(B13,C13)","v":"RB"},"LE","GJ0428202","ASSY COVER & RESET SIZE 4",1,""]
[null,"R","B",null,null,null,{"$f":"CONCATENATE(B14,C14)","v":"RB"},"TE","GJ0428202","ASSY COVER & RESET SIZE 4",1,{"$f":"IF(G14=H14,K14,\"\")","v":""}]
[null,"R","B","A",null,null,"RBA","LGA","GJ0428202","ASSY COVER & RESET SIZE 4",1,""]
[null,"R","B","A",null,null,{"$f":"CONCATENATE(B16,C16,D16)","v":"RBA"},"TGA","GJ0428202","ASSY COVER & RESET SIZE 4",1,{"$f":"IF(G16=H16,K16,\"\")","v":""}]
[null,"R","B","A",null,null,"RBA","LGB","GJ0428206","ASSY COVER AND RESET",1,""]
[null,"R","B","A",null,null,{"$f":"CONCATENATE(B18,C18,D18)","v":"RBA"},"TGB","GJ0428206","ASSY COVER AND RESET",1,{"$f":"IF(G18=H18,K18,\"\")","v":""}]
[null,"R","B","A",null,null,"RBA","LGE","GJ0428202","ASSY COVER & RESET SIZE 4",1,""]
[null,"R","B","A",null,null,{"$f":"CONCATENATE(B20,C20,D20)","v":"RBA"},"TGE","GJ0428202","ASSY COVER & RESET SIZE 4",1,{"$f":"IF(G20=H20,K20,\"\")","v":""}]
[null,null,"B",null,{"$f":"MID($A$2,11,1)","v":"0"},null,{"$f":"CONCATENATE(C21,E21)","v":"B0"},"G1","02MVAJ14002 SHT 1","INT WIRING DIAGRAM",1,""]
[null,null,"B",null,"0",null,"B0","G0","02MVAJ14002 SHT 2","INT WIRING DIAGRAM",1,""]
[null,null,"B",null,"0",null,"B0","E1","02MVAJ1403 SHT 1","INT WIRING DIAGRAM",1,""]
[null,null,"B",null,"0",null,"B0","E0","02MVAJ1403 SHT 2","INT WIRING DIAGRAM",1,""]
[null,null,"B",null,"0",null,"B0","B1","02MVAJ1410 SHT 1","INT WIRING DIAGRAM",1,""]
[null,null,"B",null,"0",null,"B0","B0","02MVAJ1411 SHT 1","INT WIRING DIAGRAM",1,1]
[null,{"$f":"MID($A$2,7,1)","v":"R"},null,null,null,null,{"$f":"B27","v":"R"},"J","GJ0013003","TERMINAL BLOCK ASSY MODULE",1,""]
[null,"R",null,null,null,null,{"$f":"B28","v":"R"},"R","GJ0013003","TERMINAL BLOCK ASSY MODULE",1,{"$f":"IF(G28=H28,K28,\"\")","v":1}]
[null,"R",null,null,null,null,"R","L","GJ0013008","TERMINAL BLOCK ASSY MODULE",1,""]
[null,"R",null,null,null,null,{"$f":"B30","v":"R"},"T","GJ0013008","TERMINAL BLOCK ASSY MODULE",1,{"$f":"IF(G30=H30,K30,\"\")","v":""}]
[null,"R",null,null,null,null,"R","L","GJ6010001","PCB SUPPORT",4,""]
[null,"R",null,null,null,null,{"$f":"B32","v":"R"},"T","GJ6010001","PCB SUPPORT",4,{"$f":"IF(G32=H32,K32,\"\")","v":""}]
[null,"R",null,null,null,null,"R","L","GJ9174217","NAMEPLATE PRINTED",1,""]
[null,"R",null,null,null,null,{"$f":"B34","v":"R"},"T","GJ9174217","NAMEPLATE PRINTED",1,{"$f":"IF(G34=H34,K34,\"\")","v":""}]
[null,"R",null,null,null,null,"R","L","GJ9179416","HANDLE STRIP PRINTED (CLEAR)",1,""]
[null,"R",null,null,null,null,{"$f":"B36","v":"R"},"T","GJ9179416","HANDLE STRIP PRINTED (CLEAR)",1,{"$f":"IF(G36=H36,K36,\"\")","v":""}]
[null,{"$f":"MID($A$2,7,1)","v":"R"},null,null,null,null,"R","J","GJ9179101","PRINTED LABEL",1,""]
[null,"R",null,null,null,null,{"$f":"B38","v":"R"},"R","GJ9179101","PRINTED LABEL",1,{"$f":"IF(G38=H38,K38,\"\")","v":1}]
[null,"R",null,null,null,null,"R","J","GJ0010118","ASSEMBLY MODULE SIZE 2",1,""]
[null,"R",null,null,null,null,{"$f":"B40","v":"R"},"R","GJ0010118","ASSEMBLY MODULE SIZE 2",1,{"$f":"IF(G40=H40,K40,\"\")","v":1}]
[null,"R",null,null,null,null,"R","L","GJ0012103","MVAJ MVAA",1,""]
[null,"R",null,null,null,null,{"$f":"B42","v":"R"},"T","GJ0012103","MVAJ MVAA",1,{"$f":"IF(G42=H42,K42,\"\")","v":""}]
[null,"R",null,null,null,null,"R","J","ZB9128022","Female push on tab (CP) fully insulated",1,""]
[null,"R",null,null,null,null,{"$f":"B44","v":"R"},"R","ZB9128022","Female push on tab (CP) fully insulated",1,{"$f":"IF(G44=H44,K44,\"\")","v":1}]
[null,"R",null,null,null,null,"R","J","ZB9128055","FEMALE TAB RECEPTACLE- BRASS-UNINSULATED",8,""]
[null,"R",null,null,null,null,{"$f":"B46","v":"R"},"R","ZB9128055","FEMALE TAB RECEPTACLE- BRASS-UNINSULATED",8,{"$f":"IF(G46=H46,K46,\"\")","v":8}]
[null,"R",null,null,{"$f":"MID($A$2,11,1)","v":"0"},null,{"$f":"CONCATENATE(B47,E47)","v":"R0"},"J0","ZB4018118","SELF TAP SCREW.FLNGE HD.SIZE 4X1/4\"(kan)",12,""]
[null,"R",null,null,{"$f":"MID($A$2,11,1)","v":"0"},null,{"$f":"CONCATENATE(B48,E48)","v":"R0"},"R0","ZB4018118","SELF TAP SCREW.FLNGE HD.SIZE 4X1/4\"(kan)",12,{"$f":"IF(G48=H48,K48,\"\")","v":12}]
[null,"R",null,null,{"$f":"MID($A$2,11,1)","v":"0"},null,{"$f":"CONCATENATE(B49,E49)","v":"R0"},"J1","ZB4018118","SELF TAP SCREW.FLNGE HD.SIZE 4X1/4\"(kan)",16,""]
[null,"R",null,null,{"$f":"MID($A$2,11,1)","v":"0"},null,{"$f":"CONCATENATE(B50,E50)","v":"R0"},"R1","ZB4018118","SELF TAP SCREW.FLNGE HD.SIZE 4X1/4\"(kan)",16,{"$f":"IF(G50=H50,K50,\"\")","v":""}]
[null,"R",null,null,null,null,{"$f":"B51","v":"R"},"L","ZB4018120","SELF TAPPING SCREW SIZE 4X 5/16\" LG",4,""]
[null,"R",null,null,null,null,{"$f":"B52","v":"R"},"T","ZB4018120","SELF TAPPING SCREW SIZE 4X 5/16\" LG",4,{"$f":"IF(G52=H52,K52,\"\")","v":""}]
[null,"R",null,null,null,null,"R","L","ZB5002036","Washer Plain M3 Brass (kan)",4,""]
[null,"R",null,null,null,null,{"$f":"B54","v":"R"},"T","ZB5002036","Washer Plain M3 Brass (kan)",4,{"$f":"IF(G54=H54,K54,\"\")","v":""}]
[null,"R",null,null,null,null,"R","L","ZB5009036","WASHER SHAKEPROOF INTERNAL M3 STEEL(kan)",6,""]
[null,"R",null,null,null,null,{"$f":"B56","v":"R"},"T","ZB5009036","WASHER SHAKEPROOF INTERNAL M3 STEEL(kan)",6,{"$f":"IF(G56=H56,K56,\"\")","v":""}]
[null,"R",null,null,null,null,"R","L","ZB5101036","M3 Hexagonal Full Nut",4,""]
[null,"R",null,null,null,null,{"$f":"B58","v":"R"},"T","ZB5101036","M3 Hexagonal Full Nut",4,{"$f":"IF(G58=H58,K58,\"\")","v":""}]
[null,"R",null,null,null,null,"R","L","ZB5326094","SCREW M3 X 8MM LG (kan)",6,""]
[null,"R",null,null,null,null,{"$f":"B60","v":"R"},"T","ZB5326094","SCREW M3 X 8MM LG (kan)",6,{"$f":"IF(G60=H60,K60,\"\")","v":""}]
[null,"R",null,null,null,null,"R","J","ZA0005060","ZA0005060 ( 20 SCREW PACK)",1,""]
[null,"R",null,null,null,null,{"$f":"B62","v":"R"},"R","ZA0005060","ZA0005060 ( 20 SCREW PACK)",1,{"$f":"IF(G62=H62,K62,\"\")","v":1}]
[null,"R",null,null,null,null,"R","L","ZA0005061","TERMINAL PACK MIDOS 28 OFF",1,""]
[null,"R",null,null,null,null,{"$f":"B64","v":"R"},"T","ZA0005061","TERMINAL PACK MIDOS 28 OFF",1,{"$f":"IF(G64=H64,K64,\"\")","v":""}]
[null,null,null,null,null,null,null,null,"ZA0005106","MIDOS MTG PACK (4X)",1,1]
["R1","R",null,null,{"$f":"MID($A$2,11,1)","v":"0"},null,{"$f":"CONCATENATE(B66,E66)","v":"R0"},"L1","ZB9012676","RES.WIREWOUND 120R-12W-5% (PLANT 1000)",1,""]
["R1","R",null,null,"0",null,"R0","T1","ZB9012676","RES.WIREWOUND 120R-12W-5% (PLANT 1000)",1,{"$f":"IF(G67=H67,K67,\"\")","v":""}]
["R2","R",null,null,"0",null,"R0","L1","ZB9012700","RES. WIREWOUND 1.2K-12W-5% [PLANT 1000]",1,""]
["R2","R",null,null,"0",null,"R0","T1","ZB9012700","RES. WIREWOUND 1.2K-12W-5% [PLANT 1000]",1,{"$f":"IF(G69=H69,K69,\"\")","v":""}]
[null,"R",null,null,"0",null,"R0","L1","ZE0002038","TAG STRIP",1,""]
[null,"R",null,null,"0",null,"R0","T1","ZE0002038","TAG STRIP",1,{"$f":"IF(G71=H71,K71,\"\")","v":""}]
[null,"R",null,null,null,null,{"$f":"B72","v":"R"},"L","ZG0891002","ASSY PCB - 2PH RECT BOARD - A/09",1,""]
[null,"R",null,null,null,null,{"$f":"B73","v":"R"},"T","ZG0891002","ASSY PCB - 2PH RECT BOARD - A/09",1,{"$f":"IF(G73=H73,K73,\"\")","v":""}]
[null,"R",null,null,{"$f":"MID($A$2,11,1)","v":"0"},null,{"$f":"CONCATENATE(B74,E74)","v":"R0"},"J0","ZJ0254001","ASSY PCB - COST-IMP'D MVAA/MVAJ - A/03",2,""]
[null,"R",null,null,{"$f":"MID($A$2,11,1)","v":"0"},null,{"$f":"CONCATENATE(B75,E75)","v":"R0"},"R0","ZJ0254001","ASSY PCB - COST-IMP'D MVAA/MVAJ - A/03",2,{"$f":"IF(G75=H75,K75,\"\")","v":2}]
[null,"R",null,null,{"$f":"MID($A$2,11,1)","v":"0"},null,{"$f":"CONCATENATE(B76,E76)","v":"R0"},"J1","ZJ0255002","ASSY PCB-MVAJ 14/15 220/250V-A/5",1,""]
[null,"R",null,null,{"$f":"MID($A$2,11,1)","v":"0"},null,{"$f":"CONCATENATE(B77,E77)","v":"R0"},"R1","ZJ0255002","ASSY PCB-MVAJ 14/15 220/250V-A/5",1,{"$f":"IF(G77=H77,K77,\"\")","v":""}]
[null,null,null,null,null,null,null,null,{"$f":"'Aux Units'!$B$12","v":"FB0307029.28"},{"$f":"'Aux Units'!$C$12","v":"AUX(coil ZC0228027)5M CUT OFF"},1,1]
[null,null,null,null,null,null,null,null,"Aux Unit",{"$f":"IF($J$78=\"See Below\",'Aux Units'!B1,)","v":0},1,{"$f":"IF(J79>1,1,\"\")","v":""}]
[null,null,null,null,null,null,null,null,"Flag",{"$f":"IF($J$78=\"See Below\",'Aux Units'!B2,)","v":0},1,{"$f":"IF(J80>1,1,\"\")","v":""}]
[null,null,null,null,null,null,null,null,"Coil",{"$f":"IF($J$78=\"See Below\",'Aux Units'!B3,)","v":0},1,{"$f":"IF(J81>1,1,\"\")","v":""}]
[null,null,null,null,null,null,null,null,"Contacts",{"$f":"IF($J$78=\"See Below\",'Aux Units'!B4,)","v":0},1,{"$f":"IF(J82>1,1,\"\")","v":""}]
[null,null,null,null,null,null,null,null,"Reset Unit",{"$f":"IF($J$78=\"See Below\",'Aux Units'!B5,)","v":0},1,{"$f":"IF(J83>1,1,\"\")","v":""}]

{"sheet":"Database","index":5,"n_rows":101,"n_cols":12,"rows_kept":101,"cut":false,"hidden":true,"merged":[]}
[]
[null,1]
[1,{"$f":"HLOOKUP('Date Drivers'!$B$1,'Date Drivers'!$B$2:$C$103,2)","v":"Five"},{"$f":"HLOOKUP('Date Drivers'!$B$1,'Date Drivers'!$B$2:$C$103,5)","v":"B"},"Without Flag Indicator","With Hand Reset Flag Indicator","With Self Reset Flag Indicator","A","B","E"]
[2,{"$f":"HLOOKUP('Date Drivers'!$B$1,'Date Drivers'!$B$2:$C$103,3)","v":"Eight"},{"$f":"HLOOKUP('Date Drivers'!$B$1,'Date Drivers'!$B$2:$C$103,6)","v":"E"},"With Self Reset Flag Indicator"," "," ","E","E","E"]
[3,{"$f":"HLOOKUP('Date Drivers'!$B$1,'Date Drivers'!$B$2:$C$103,4)","v":"Ten"},{"$f":"HLOOKUP('Date Drivers'!$B$1,'Date Drivers'!$B$2:$C$103,7)","v":"G"},"Without Flag Indicator","With Hand Reset Flag Indicator","With Self Reset Flag Indicator","A","B","E"]
[null,null,null,null,null,null,null,null,{"$f":"Configurator!E14","v":1}]
[null,1,null,{"$f":"B2","v":1},null,null,null,null,1,"0001"]
[1,{"$f":"HLOOKUP('Date Drivers'!$B$1,'Date Drivers'!$B$2:$C$103,8)","v":"5 Normally Open (5M)"},{"$f":"HLOOKUP('Date Drivers'!$B$1,'Date Drivers'!$B$2:$C$103,17)","v":"0001"},1,2,3,null,null,2,"0002"]
[2,{"$f":"HLOOKUP('Date Drivers'!$B$1,'Date Drivers'!$B$2:$C$103,9)","v":"4 Normally Open + 1 Normally Closed (4M + 1B)"},{"$f":"HLOOKUP('Date Drivers'!$B$1,'Date Drivers'!$B$2:$C$103,18)","v":"0002"},"5 Normally Open (5M)","6 Normally Open + 2 Normally Closed (6M + 2B)","10 Normally Open (10M)",null,null,4,"0004"]
[3,{"$f":"HLOOKUP('Date Drivers'!$B$1,'Date Drivers'!$B$2:$C$103,10)","v":"3 Normally Open + 2 Normally Closed (3M + 2B)"},{"$f":"HLOOKUP('Date Drivers'!$B$1,'Date Drivers'!$B$2:$C$103,19)","v":"0004"},"4 Normally Open + 1 Normally Closed (4M + 1B)","5 Normally Open + 3 Normally Closed (5M + 3B)","9 Normally Open + 1 Normally Closed (9M + 1B)",null,null,6,"0006"]
[4,{"$f":"HLOOKUP('Date Drivers'!$B$1,'Date Drivers'!$B$2:$C$103,11)","v":"2 Normally Open + 3 Normally Closed (2M + 3B)"},{"$f":"HLOOKUP('Date Drivers'!$B$1,'Date Drivers'!$B$2:$C$103,20)","v":"0006"},"3 Normally Open + 2 Normally Closed (3M + 2B)","4 Normally Open + 4 Normally Closed (4M + 4B)","8 Normally Open + 2 Normally Closed (8M + 2B)",null,null,8,"0008"]
[5,{"$f":"HLOOKUP('Date Drivers'!$B$1,'Date Drivers'!$B$2:$C$103,12)","v":"1 Normally Open + 4 Normally Closed (1M + 4B)"},{"$f":"HLOOKUP('Date Drivers'!$B$1,'Date Drivers'!$B$2:$C$103,21)","v":"0008"},"2 Normally Open + 3 Normally Closed (2M + 3B)"," ","7 Normally Open + 3 Normally Closed (7M + 3B)",null,null,11,"0011"]
[6,{"$f":"HLOOKUP('Date Drivers'!$B$1,'Date Drivers'!$B$2:$C$103,13)","v":"5 Normally Closed (5B)"},{"$f":"HLOOKUP('Date Drivers'!$B$1,'Date Drivers'!$B$2:$C$103,22)","v":"0011"},"1 Normally Open + 4 Normally Closed (1M + 4B)"," ","6 Normally Open + 4 Normally Closed (6M + 4B)",null,null,21,"0021"]
[7,{"$f":"HLOOKUP('Date Drivers'!$B$1,'Date Drivers'!$B$2:$C$103,14)","v":" "},{"$f":"HLOOKUP('Date Drivers'!$B$1,'Date Drivers'!$B$2:$C$103,23)","v":"0011"},"5 Normally Closed (5B)"," ","5 Normally Open + 5 Normally Closed (5M + 5B)",null,null,22,"0022"]
[8,{"$f":"HLOOKUP('Date Drivers'!$B$1,'Date Drivers'!$B$2:$C$103,15)","v":" "},{"$f":"HLOOKUP('Date Drivers'!$B$1,'Date Drivers'!$B$2:$C$103,24)","v":"0011"}," "," ","4 Normally Open + 6 Normally Closed (4M + 6B)",null,null,24,"0024"]
[9,{"$f":"HLOOKUP('Date Drivers'!$B$1,'Date Drivers'!$B$2:$C$103,16)","v":" "},{"$f":"HLOOKUP('Date Drivers'!$B$1,'Date Drivers'!$B$2:$C$103,25)","v":"0011"}," "," ","3 Normally Open + 7 Normally Closed (3M + 7B)",null,null,27,"0027",null,""]
[null,null,null," "," ","2 Normally Open + 8 Normally Closed (2M + 8B)",null,null,30,"0030"]
[null,1,null,"0001","0032","0021",null,null,33,"0033"]
[1,{"$f":"HLOOKUP('Date Drivers'!$B$1,'Date Drivers'!$B$2:$C$103,26)","v":"24-27 Vac/Vdc"},{"$f":"HLOOKUP('Date Drivers'!$B$1,'Date Drivers'!$B$2:$C$103,31)","v":"0000"},"0002","0035","0022",null,null,36,"0036"]
[2,{"$f":"HLOOKUP('Date Drivers'!$B$1,'Date Drivers'!$B$2:$C$103,27)","v":"30-34 Vac/Vdc"},{"$f":"HLOOKUP('Date Drivers'!$B$1,'Date Drivers'!$B$2:$C$103,32)","v":"0250"},"0004","0038","0024",null,null,39,"0039"]
[3,{"$f":"HLOOKUP('Date Drivers'!$B$1,'Date Drivers'!$B$2:$C$103,28)","v":"48-54 Vac/Vdc"},{"$f":"HLOOKUP('Date Drivers'!$B$1,'Date Drivers'!$B$2:$C$103,33)","v":"0500"},"0006","0038","0027",null,null,42,"0042"]
[4,{"$f":"HLOOKUP('Date Drivers'!$B$1,'Date Drivers'!$B$2:$C$103,29)","v":"110-125 Vac/Vdc"},{"$f":"HLOOKUP('Date Drivers'!$B$1,'Date Drivers'!$B$2:$C$103,34)","v":"0750"},"0008","0038","0030",null,null,48,"0048"]
[5,{"$f":"HLOOKUP('Date Drivers'!$B$1,'Date Drivers'!$B$2:$C$103,30)","v":"220-250 Vac/Vdc"},{"$f":"HLOOKUP('Date Drivers'!$B$1,'Date Drivers'!$B$2:$C$103,35)","v":"1000"},"0011","0038","0033",null,null,49,"0049"]
[null,null,null,"0011","0038","0036",null,null,251,"0251"]
[null,1,null,"0011","0038","0039",null,null,252,"0252"]
[1,{"$f":"HLOOKUP('Date Drivers'!$B$1,'Date Drivers'!$B$2:$C$103,36)","v":"Without Flag Indicator"},{"$f":"HLOOKUP('Date Drivers'!$B$1,'Date Drivers'!$B$2:$C$103,39)","v":"A"},"0011","0038","0042",null,null,254,"0254"]
[2,{"$f":"HLOOKUP('Date Drivers'!$B$1,'Date Drivers'!$B$2:$C$103,37)","v":"With Hand Reset Flag Indicator"},{"$f":"HLOOKUP('Date Drivers'!$B$1,'Date Drivers'!$B$2:$C$103,40)","v":"B"},null,null,null,null,null,256,"0256"]
[3,{"$f":"HLOOKUP('Date Drivers'!$B$1,'Date Drivers'!$B$2:$C$103,38)","v":"With Self Reset Flag Indicator"},{"$f":"HLOOKUP('Date Drivers'!$B$1,'Date Drivers'!$B$2:$C$103,41)","v":"E"},null,null,null,null,null,258,"0258"]
[null,{"$f":"B2*10+B7","v":11},null,null,null,{"$f":"CONCATENATE(Configurator!$E$5,Configurator!$F$5)","v":"BA"},"Auxiliary Unit",null,261,"0261"]
[null,11,21,31,null,"BA","FB0307029","A",271,"0271"]
[null,"24-27 Vac/Vdc","48-54 Vac/Vdc","24-27 Vac/Vdc",null,"BB","FB0307024","B",272,"0272"]
[null,"30-34 Vac/Vdc","110-125 Vac/Vdc","30-34 Vac/Vdc",null,"BE","FB0307005","C",274,"0274"]
[null,"48-54 Vac/Vdc","220-250 Vac/Vdc","48-54 Vac/Vdc",null,"EE","FB0307006","D",277,"0277"]
[null,"110-125 Vac/Vdc","","110-125 Vac/Vdc",null,"GA","FB0307026","E",280,"0280"]
[null,"220-250 Vac/Vdc"," ","220-250 Vac/Vdc",null,"GB","FB0307025","F",283,"0283"]
[null,"0000","0500","0000",null,"GE","FB0307006","D",286,"0286"]
[null,"0250","0750","0250",null,null,null,null,289,"0289"]
[null,"0500","1000","0500",null,{"$f":"Configurator!$D$10","v":"B"},"Master Text Line 3 and Case Number",null,292,"0292"]
[null,"0750","1000","0750",null,"B","Five Pair Outgoing Contacts. Single Stack","GJ0414103",298,"0298"]
[null,"1000","1000","1000",null,"E","Eight Pair Outgoing Contacts. Operating Time 15 Milliseconds. Double Stack","GJ0416111",299,"0299"]
[null,null,null,null,null,"G","Ten Pair Outgoing Contacts. Double Stack","GJ0416111",501,"0501"]
[null,null,null,{"$f":"B2*10+B7","v":11},"Contact Arrangement",null,null,null,502,"0502"]
[null,null,11,"FB0317006","01",{"$f":"Configurator!$D$12","v":"A"},"Flag",null,504,"0504"]
[null,null,12,"FB0317007","02","A","FB0295020","A",506,"0506"]
[null,null,13,"FB0317008","03","B","FB0295019","B",508,"0508"]
[null,null,14,"FB0317009","04","E","None","C",511,"0511"]
[null,null,15,"FB0317010","05",{"$f":"Configurator!G5","v":"0001"},{"$f":"LEFT(F47,1)","v":"0"},null,521,"0521"]
[null,null,16,"FB0317011","06",{"$f":"CONCATENATE(Configurator!$E$5,$G$47)","v":"B0"},"Customer Wiring Diagram",null,522,"0522"]
[null,null,21,"FB0316015 + FB0317058","07","B0","01MVAJ1411.SHEET.1",null,524,"0524"]
[null,null,22,"FB0316016 + FB0317058","08","B1","01MVAJ1410.SHEET.1",null,527,"0527"]
[null,null,23,"FB0316017 + FB0317058","09","E0","01MVAJ1403.SHEET.1",null,530,"0530"]
[null,null,31,"FB0316026 + FB0317012","10","E1","01MVAJ1403.SHEET.1",null,532,"0532"]
[null,null,32,"FB0316027 + FB0317012","11","G0","01MVAJ14002.SHEET.1",null,533,"0533"]
[null,null,33,"FB0316028 + FB0317012","12","G1","01MVAJ14002.SHEET.1",null,535,"0535"]
[null,null,34,"FB0316029 + FB0317012","13",null,null,null,536,"0536"]
[null,null,35,"FB0316031 + FB0317012","14",{"$f":"CONCATENATE(Configurator!$E$5,Configurator!$F$5)","v":"BA"},"Reset & Outline Wrapper",null,538,"0538"]
[null,null,36,"FB0316337 + FB0317012","15","BA","GJ0428022","GJ0025.SHEET.1",539,"0539"]
[null,null,37,"FB0316029 + FB0317014","16","BB","GJ0428037","GJ0025.SHEET.1",542,"0542"]
[null,null,38,"FB0316031 + FB0317014","17","BE","GJ0428022","GJ0025.SHEET.1",548,"0548"]
[{"$f":"CONCATENATE(Configurator!$D$10,Configurator!$D$16)","v":"B0000"},"Coil & Reset Unit",39,"FB0316337 + FB0317014","18","EE","GJ0428202","GJ0025.SHEET.3",549,"0549"]
["B0000","ZC0228027","H","FB0247478.24",null,"GA","GJ0428202","GJ0025.SHEET.3",751,"0751"]
["B0250","ZC0228025","G","FB0247478.18",null,"GB","GJ0428206","GJ0025.SHEET.3",752,"0752"]
["B0500","ZC0228020","E","FB0247478.22",null,"GE","GJ0428202","GJ0025.SHEET.3",754,"0754"]
["B0750","ZC0228014","C","FB0247478.02",null,null,null,null,756,"0756"]
["B1000","ZC0228013","B","FB0247478.02",{"$f":"CONCATENATE(Configurator!$E$5,Configurator!$F$5)","v":"BA"},"Design Issue",null,null,758,"0758"]
["E0500","ZC0228024","F","FB0247478.05","BA","F",null,null,761,"0761"]
["E0750","ZC0228017","D","FB0247478.09","BB","F",null,null,771,"0771"]
["E1000","ZC0228012","A","FB0247478.02","BE","F",null,null,771,"0771"]
["G0000","ZC0228030","J","FB0247478.07","EE","B",null,null,772,"0772"]
["G0250","ZC0228028","I","FB0247478.24","GA","B",null,null,774,"0774"]
["G0500","ZC0228024","F","FB0247478.05","GB","B",null,null,777,"0777"]
["G0750","ZC0228017","D","FB0247478.09","GE","A",null,null,780,"0780"]
["G1000","ZC0228012","A","FB0247478.02",null,null,null,null,782,"0782"]
[null,null,null,null,null,null,null,null,783,"0783"]
[{"$f":"Configurator!$D$10","v":"B"},"Case Size",null,null,null,null,null,null,785,"0785"]
["B","Housed in a Size 2 Case",{"$f":"HLOOKUP('Date Drivers'!$B$1,'Date Drivers'!$B$2:$C$44,42)","v":"R1"},null,null,null,null,null,786,"0786"]
["E","Housed in a Size 4 Case",{"$f":"HLOOKUP('Date Drivers'!$B$1,'Date Drivers'!$B$2:$C$44,43)","v":"T1"},null,null,null,null,null,788,"0788"]
["G","Housed in a Size 4 Case",{"$f":"HLOOKUP('Date Drivers'!$B$1,'Date Drivers'!$B$2:$C$44,43)","v":"T1"},null,null,null,null,null,789,"0789"]
[null,null,null,null,null,null,null,null,792,"0792"]
[{"$f":"CONCATENATE(Configurator!$E$5,Configurator!$F$5,Configurator!$G$5)","v":"BA0001"},null,null,null,null,null,null,null,798,"0798"]
["BA0001"," "," "," "," ",null,null,null,799,"0799"]
["EE1032","R1","120 Ohm","R2","1200 Ohm",null,null,null,1001,"1001"]
["GA0001"," "," "," "," ",null,null,null,1002,"1002"]
["GA1021","R1","120 Ohm","R2","1200 Ohm",null,null,null,1004,"1004"]
["GB0001"," "," "," "," ",null,null,null,1006,"1006"]
["GB1021","R1","120 Ohm","R2","1200 Ohm",null,null,null,1008,"1008"]
["GE0001"," "," "," "," ",null,null,null,1011,"1011"]
["GE1021","R1","120 Ohm","R2","1200 Ohm",null,null,null,1021,"1021"]
[null,null,null,null,null,null,null,null,1022,"1022"]
[null,null,null,null,null,null,null,null,1024,"1024"]
[null,null,null,null,null,null,null,null,1027,"1027"]
[null,null,null,null,null,null,null,null,1030,"1030"]
[null,null,null,null,null,null,null,null,1032,"1032"]
[null,null,null,null,null,null,null,null,1033,"1033"]
[null,null,null,null,null,null,null,null,1035,"1035"]
[null,null,null,null,null,null,null,null,1036,"1036"]
[null,null,null,null,null,null,null,null,1038,"1038"]
[null,null,null,null,null,null,null,null,1039,"1039"]
[null,null,null,null,null,null,null,null,1042,"1042"]
[null,null,null,null,null,null,null,null,1048,"1048"]
[null,null,null,null,null,null,null,null,1049,"1049"]

{"sheet":"Aux Units","index":6,"n_rows":248,"n_cols":3,"rows_kept":248,"cut":false,"hidden":true,"merged":[]}
["Aux Unit",{"$f":"VLOOKUP(Database!$F$29,Database!$F$30:$G$36,2,FALSE)","v":"FB0307029"},{"$f":"VLOOKUP(Database!$F$29,Database!$F$30:$H$36,3,FALSE)","v":"A"}]
["Flag",{"$f":"VLOOKUP(Database!$F$43,Database!$F$44:$G$46,2,FALSE)","v":"FB0295020"},{"$f":"VLOOKUP(Database!$F$43,Database!$F$44:$H$46,3,FALSE)","v":"A"}]
["Coil",{"$f":"VLOOKUP(Database!$A$60,Database!$A$61:$E$73,2,FALSE)","v":"ZC0228027"},{"$f":"VLOOKUP(Database!$A$60,Database!$A$61:$E$73,3,FALSE)","v":"H"}]
["Contacts",{"$f":"VLOOKUP(Database!$D$42,Database!$C$43:$D$60,2)","v":"FB0317006"},{"$f":"VLOOKUP(Database!$D$42,Database!$C$43:$E$60,3)","v":"01"}]
["2nd Aux Unit",{"$f":"VLOOKUP(Database!$A$60,Database!$A$61:$E$73,4,FALSE)","v":"FB0247478.24"}]
["New Aux Unit.Suffix (If Req'd)->",null,{"$f":"CONCATENATE($B$1,\".   \")","v":"FB0307029.   "}]
[]
["Copy From      -------------->",null,{"$f":"C6","v":"FB0307029.   "}]
[]
[]
[]
[{"$f":"CONCATENATE($C$1,$C$2,$C$3,$C$4)","v":"AAH01"},{"$f":"VLOOKUP(A12,$A$15:$C$614,2,FALSE)","v":"FB0307029.28"},{"$f":"VLOOKUP(A12,$A$15:$C$614,3,FALSE)","v":"AUX(coil ZC0228027)5M CUT OFF"}]
[]
["Lookup Table"]
["AAB01","FB0307029.???","See Below"]
["AAB02","FB0307029.???","See Below"]
["AAB03","FB0307029.15","AUX COIL ZC0228013/012 3M2B  1B CUT OFF"]
["AAB04","FB0307029.???","See Below"]
["AAB05","FB0307029.???","See Below"]
["AAB06","FB0307029.???","See Below"]
["AAC01","FB0307029.23","AUX RELAY (coil ZC0228014)5M 1B CUT OFF"]
["AAC02","FB0307029.03","AUX (coil ZC0228014/12)4M 1B, 1B CUT OFF"]
["AAC03","FB0307029.???","See Below"]
["AAC04","FB0307029.08","AUX RELAY(coil ZC0228014)3B 2M 1B C/OFF"]
["AAC05","FB0307029.???","See Below"]
["AAC06","FB0307029.???","See Below"]
["AAE01","FB0307029.???","See Below"]
["AAE02","FB0307029.???","See Below"]
["AAE03","FB0307029.???","See Below"]
["AAE04","FB0307029.???","See Below"]
["AAE05","FB0307029.???","See Below"]
["AAE06","FB0307029.???","See Below"]
["AAG01","FB0307029.???","See Below"]
["AAG02","FB0307029.???","See Below"]
["AAG03","FB0307029.26","AUX(coil ZC0228025/21)3M 2B 1B CUT OFF"]
["AAG04","FB0307029.???","See Below"]
["AAG05","FB0307029.???","See Below"]
["AAG06","FB0307029.???","See Below"]
["AAH01","FB0307029.28","AUX(coil ZC0228027)5M CUT OFF"]
["AAH02","FB0307029.???","See Below"]
["AAH03","FB0307029.???","See Below"]
["AAH04","FB0307029.???","See Below"]
["AAH05","FB0307029.???","See Below"]
["AAH06","FB0307029.???","See Below"]
["BBB01","FB0307024.???","See Below"]
["BBB02","FB0307024.???","See Below"]
["BBB03","FB0307024.???","See Below"]
["BBB04","FB0307024.???","See Below"]
["BBB05","FB0307024.???","See Below"]
["BBB06","FB0307024.???","See Below"]
["BBC01","FB0307024.14","AUX (coil ZC0228014/12)5M, 1B CUT OFF"]
["BBC02","FB0307024.15","AUX(coil ZC0228014)4M 1B 1B CUT OFF"]
["BBC03","FB0307024.17","AUX (coil ZC0228014/12)3M 2B, 1B CUT OFF"]
["BBC04","FB0307024.???","See Below"]
["BBC05","FB0307024.???","See Below"]
["BBC06","FB0307024.???","See Below"]
["BBE01","FB0307024.???","See Below"]
["BBE02","FB0307024.34","AUX(coil ZC0228020/18) 4M 1B 1B CUT OFF"]
["BBE03","FB0307024.???","See Below"]
["BBE04","FB0307024.23","AUX OP & R- ZC0228020 2M3B & 1CUT OFF"]
["BBE05","FB0307024.???","See Below"]
["BBE06","FB0307024.???","See Below"]
["BBG01","FB0307024.???","See Below"]
["BBG02","FB0307024.19","AUX(coil ZC0228025)4M 1B 1B CUT OFF"]
["BBG03","FB0307024.26","AUX (coil ZC0228025/21) 3M 2B 1Bc/o"]
["BBG04","FB0307024.???","See Below"]
["BBG05","FB0307024.???","See Below"]
["BBG06","FB0307024.???","See Below"]
["BBH01","FB0307024.???","See Below"]
["BBH02","FB0307024.???","See Below"]
["BBH03","FB0307024.32","AUX OP&R- ZC0228027/24 3M2B & 1CUT OFF"]
["BBH04","FB0307024.???","See Below"]
["BBH05","FB0307024.???","See Below"]
["BBH06","FB0307024.???","See Below"]
["CCB01","FB0307005.???","See Below"]
["CCB02","FB0307005.???","See Below"]
["CCB03","FB0307005.???","See Below"]
["CCB04","FB0307005.???","See Below"]
["CCB05","FB0307005.???","See Below"]
["CCB06","FB0307005.???","See Below"]
["CCC01","FB0307005.???","See Below"]
["CCC02","FB0307005.???","See Below"]
["CCC03","FB0307005.02","AUX (coil ZC0228014/12) 3M 2B 1Bc/o"]
["CCC04","FB0307005.???","See Below"]
["CCC05","FB0307005.???","See Below"]
["CCC06","FB0307005.???","See Below"]
["CCE01","FB0307005.???","See Below"]
["CCE02","FB0307005.???","See Below"]
["CCE03","FB0307005.???","See Below"]
["CCE04","FB0307005.???","See Below"]
["CCE05","FB0307005.???","See Below"]
["CCE06","FB0307005.???","See Below"]
["CCG01","FB0307005.???","See Below"]
["CCG02","FB0307005.???","See Below"]
["CCG03","FB0307005.01","AUX (coil ZC0228025/21) 3M 2B 1Bc/o"]
["CCG04","FB0307005.???","See Below"]
["CCG05","FB0307005.???","See Below"]
["CCG06","FB0307005.???","See Below"]
["CCH01","FB0307005.???","See Below"]
["CCH02","FB0307005.???","See Below"]
["CCH03","FB0307005.03","AUX (coil ZC0228027/24) 3M 2B 1Bc/o"]
["CCH04","FB0307005.???","See Below"]
["CCH05","FB0307005.???","See Below"]
["CCH06","FB0307005.???","See Below"]
["DCA07","FB0307006.???","See Below"]
["DCA08","FB0307006.???","See Below"]
["DCA09","FB0307006.???","See Below"]
["DCA10","FB0307006.???","See Below"]
["DCA11","FB0307006.???","See Below"]
["DCA12","FB0307006.???","See Below"]
["DCA13","FB0307006.???","See Below"]
["DCA14","FB0307006.???","See Below"]
["DCA15","FB0307006.???","See Below"]
["DCA16","FB0307006.???","See Below"]
["DCA17","FB0307006.???","See Below"]
["DCA18","FB0307006.???","See Below"]
["DCD07","FB0307006.29","AUX coil ZC0228017/77 RH4M LH2M2B1B C/O"]
["DCD08","FB0307006.???","See Below"]
["DCD09","FB0307006.05","AUX ZC0228017/77 LH-2M2B1Bc/o RH-2M2B"]
["DCD10","FB0307006.41","AUX(ZC0228017/077)RH-6M LH-4M1B C/O"]
["DCD11","FB0307006.39","AUX(ZC0228017/077)RH-5M1B LH-4M1B C/O"]
["DCD12","FB0307006.40","AUX(ZC0228017/077)RH-4M2B LH-4M1B C/O"]
["DCD13","FB0307006.???","See Below"]
["DCD14","FB0307006.30","AUX coil ZC0228017/77 LH-4M1B RH-2M4B"]
["DCD15","FB0307006.34","228017L317012-4M1BCO R316337-1M5B396SZ38"]
["DCD16","FB0307006.32","AUX coil ZC0228017/77 LH-1M4B RH-3M32B"]
["DCD17","FB0307006.???","See Below"]
["DCD18","FB0307006.???","See Below"]
["DCF07","FB0307006.26","AUX coil ZC0228024/20 RH4M LH2M2B1B"]
["DCF08","FB0307006.???","See Below"]
["DCF09","FB0307006.06","AUX coil ZC0228024/20 RH2M2B LH2M2B1Bc/o"]
["DCF10","FB0307006.???","See Below"]
["DCF11","FB0307006.???","See Below"]
["DCF12","FB0307006.???","See Below"]
["DCF13","FB0307006.23","AUX (coil ZC0228024/020) LH4M1B RH3M3B"]
["DCF14","FB0307006.???","See Below"]
["DCF15","FB0307006.28","AUX (coil ZC0228024/20) LH4M1B RH1M5B"]
["DCF16","FB0307006.???","See Below"]
["DCF17","FB0307006.???","See Below"]
["DCF18","FB0307006.???","See Below"]
["DCI10","FB0307006.???","See Below"]
["DCI11","FB0307006.???","See Below"]
["DCI12","FB0307006.???","See Below"]
["DCI13","FB0307006.???","See Below"]
["DCI14","FB0307006.22","AUX coil ZC0228028 LH-4M1B RH-2M4B"]
["DCI15","FB0307006.38","AUX (coil ZC0228028/24) LH4M1BC/O RH1M5B"]
["DCI16","FB0307006.???","See Below"]
["DCI17","FB0307006.???","See Below"]
["DCI18","FB0307006.???","See Below"]
["DCJ10","FB0307006.???","See Below"]
["DCJ11","FB0307006.???","See Below"]
["DCJ12","FB0307006.???","See Below"]
["DCJ13","FB0307006.???","See Below"]
["DCJ14","FB0307006.???","See Below"]
["DCJ15","FB0307006.???","See Below"]
["DCJ16","FB0307006.???","See Below"]
["DCJ17","FB0307006.???","See Below"]
["DCJ18","FB0307006.???","See Below"]
["EAA10","FB0307026.???","See Below"]
["EAA11","FB0307026.???","See Below"]
["EAA12","FB0307026.???","See Below"]
["EAA13","FB0307026.???","See Below"]
["EAA14","FB0307026.13","AUX(coil ZC0228012)RH-2M4B LH-4M1B C/OFF"]
["EAA15","FB0307026.???","See Below"]
["EAA16","FB0307026.???","See Below"]
["EAA17","FB0307026.???","See Below"]
["EAA18","FB0307026.???","See Below"]
["EAD10","FB0307026.68","AUX coil (ZC0228017/77) 10M C/O"]
["EAD11","FB0307026.65","AUX coil ZC0228017/77) 5M 1B 4M1B C/O"]
["EAD12","FB0307026.37","AUX(coil ZC0228017/077)RH-4M2B LH-4M1B"]
["EAD13","FB0307026.???","See Below"]
["EAD14","FB0307026.16","AUX(coil ZC0228017/77) RH2M4B LH4M1B C/O"]
["EAD15","FB0307026.17","AUX(coil ZC0228017/77)RH1M5B LH4M1B C/O"]
["EAD16","FB0307026.???","See Below"]
["EAD17","FB0307026.22","AUX(coil ZC0228017)RH-2M4B LH-3B1M1B C/O"]
["EAD18","FB0307026.???","See Below"]
["EAF10","FB0307026.???","See Below"]
["EAF11","FB0307026.???","See Below"]
["EAF12","FB0307026.???","See Below"]
["EAF13","FB0307026.???","See Below"]
["EAF14","FB0307026.???","See Below"]
["EAF15","FB0307026.???","See Below"]
["EAF16","FB0307026.???","See Below"]
["EAF17","FB0307026.???","See Below"]
["EAF18","FB0307026.???","See Below"]
["EAI10","FB0307026.???","See Below"]
["EAI11","FB0307026.???","See Below"]
["EAI12","FB0307026.???","See Below"]
["EAI13","FB0307026.???","See Below"]
["EAI14","FB0307026.???","See Below"]
["EAI15","FB0307026.???","See Below"]
["EAI16","FB0307026.???","See Below"]
["EAI17","FB0307026.???","See Below"]
["EAI18","FB0307026.???","See Below"]
["EAJ10","FB0307026.???","See Below"]
["EAJ11","FB0307026.???","See Below"]
["EAJ12","FB0307026.???","See Below"]
["EAJ13","FB0307026.???","See Below"]
["EAJ14","FB0307026.???","See Below"]
["EAJ15","FB0307026.???","See Below"]
["EAJ16","FB0307026.???","See Below"]
["EAJ17","FB0307026.???","See Below"]
["EAJ18","FB0307026.???","See Below"]
["FBA10","FB0307025.165","228012L3170124M1BCTOFR3160266M,396Z0238"]
["FBA11","FB0307025.176","AUX (ZC0228012) 9M 1B"]
["FBA12","FB0307025.???","See Below"]
["FBA13","FB0307025.???","See Below"]
["FBA14","FB0307025.???","See Below"]
["FBA15","FB0307025.???","See Below"]
["FBA16","FB0307025.???","See Below"]
["FBA17","FB0307025.???","See Below"]
["FBA18","FB0307025.???","See Below"]
["FBD10","FB0307025.139","AUX(coil ZC0228017/077)RH-6M LH-4M1B C/O"]
["FBD11","FB0307025.???","See Below"]
["FBD12","FB0307025.102","AUX RELAY (ZC0228017/77)RH4M2B LH4M1BC/O"]
["FBD13","FB0307025.48","AUX coil ZC0228017/077 RH-3M3B LH-4M1B"]
["FBD14","FB0307025.50","AUX (coil ZC0228017/77) LH4M1B RH2M4B"]
["FBD15","FB0307025.52","Coil ZC0228 Op-017 R-077 LH-4M1B RH-1M5B"]
["FBD16","FB0307025.???","See Below"]
["FBD17","FB0307025.???","See Below"]
["FBD18","FB0307025.???","See Below"]
["FBF10","FB0307025.89","OP-ZC0228020-ZC0228024 RH-6M LH-4M1B"]
["FBF11","FB0307025.???","See Below"]
["FBF12","FB0307025.???","See Below"]
["FBF13","FB0307025.81","AUX coil ZC0228024/20 RH-3M3B LH-4M1Bc/o"]
["FBF14","FB0307025.???","See Below"]
["FBF15","FB0307025.109","AUX (coil ZC0228024/20) LH4M1BC/0 RH1M5B"]
["FBF16","FB0307025.???","See Below"]
["FBF17","FB0307025.???","See Below"]
["FBF18","FB0307025.???","See Below"]
["FBI10","FB0307025.???","See Below"]
["FBI11","FB0307025.???","See Below"]
["FBI12","FB0307025.177","AUX (coil ZC0228028 8M2BC/OFF"]
["FBI13","FB0307025.???","See Below"]
["FBI14","FB0307025.???","See Below"]
["FBI15","FB0307025.???","See Below"]
["FBI16","FB0307025.???","See Below"]
["FBI17","FB0307025.???","See Below"]
["FBI18","FB0307025.???","See Below"]
["FBJ10","FB0307025.???","See Below"]
["FBJ11","FB0307025.???","See Below"]
["FBJ12","FB0307025.???","See Below"]
["FBJ13","FB0307025.???","See Below"]
["FBJ14","FB0307025.???","See Below"]
["FBJ15","FB0307025.173","AUX ZC0228030/27 LH-4M1Bc/o RH-1M5B"]
["FBJ16","FB0307025.???","See Below"]
["FBJ17","FB0307025.???","See Below"]
["FBJ18","FB0307025.???","See Below"]

{"sheet":"Date Drivers","index":7,"n_rows":44,"n_cols":3,"rows_kept":44,"cut":false,"hidden":true,"merged":[]}
["Key Date",{"$f":"IF(Configurator!$A$3=\"\",TODAY(),Configurator!$A$3)","v":"2025-08-18"}]
[null,"2004-01-05","2004-11-01"]
["Number of Contacts","Five","Five"]
[null,"Eight","Eight"]
[null,"Ten","Ten"]
[null,"B","B"]
[null,"E","E"]
[null,"G","G"]
["Contact Combination",{"$f":"HLOOKUP(Database!$D$7,Database!$D$8:$H$28,2)","v":"5 Normally Open (5M)"},{"$f":"HLOOKUP(Database!$D$7,Database!$D$8:$H$28,2)","v":"5 Normally Open (5M)"}]
[null,{"$f":"HLOOKUP(Database!$D$7,Database!$D$8:$H$28,3)","v":"4 Normally Open + 1 Normally Closed (4M + 1B)"},{"$f":"HLOOKUP(Database!$D$7,Database!$D$8:$H$28,3)","v":"4 Normally Open + 1 Normally Closed (4M + 1B)"}]
[null,{"$f":"HLOOKUP(Database!$D$7,Database!$D$8:$H$28,4)","v":"3 Normally Open + 2 Normally Closed (3M + 2B)"},{"$f":"HLOOKUP(Database!$D$7,Database!$D$8:$H$28,4)","v":"3 Normally Open + 2 Normally Closed (3M + 2B)"}]
[null,{"$f":"HLOOKUP(Database!$D$7,Database!$D$8:$H$28,5)","v":"2 Normally Open + 3 Normally Closed (2M + 3B)"},{"$f":"HLOOKUP(Database!$D$7,Database!$D$8:$H$28,5)","v":"2 Normally Open + 3 Normally Closed (2M + 3B)"}]
[null,{"$f":"HLOOKUP(Database!$D$7,Database!$D$8:$H$28,6)","v":"1 Normally Open + 4 Normally Closed (1M + 4B)"},{"$f":"HLOOKUP(Database!$D$7,Database!$D$8:$H$28,6)","v":"1 Normally Open + 4 Normally Closed (1M + 4B)"}]
[null,{"$f":"HLOOKUP(Database!$D$7,Database!$D$8:$H$28,7)","v":"5 Normally Closed (5B)"},{"$f":"HLOOKUP(Database!$D$7,Database!$D$8:$H$28,7)","v":"5 Normally Closed (5B)"}]
[null,{"$f":"HLOOKUP(Database!$D$7,Database!$D$8:$H$28,8)","v":" "},{"$f":"HLOOKUP(Database!$D$7,Database!$D$8:$H$28,8)","v":" "}]
[null,{"$f":"HLOOKUP(Database!$D$7,Database!$D$8:$H$28,9)","v":" "},{"$f":"HLOOKUP(Database!$D$7,Database!$D$8:$H$28,9)","v":" "}]
[null,{"$f":"HLOOKUP(Database!$D$7,Database!$D$8:$H$28,10)","v":" "},{"$f":"HLOOKUP(Database!$D$7,Database!$D$8:$H$28,10)","v":" "}]
[null,{"$f":"HLOOKUP(Database!$D$7,Database!$D$8:$H$28,11)","v":"0001"},{"$f":"HLOOKUP(Database!$D$7,Database!$D$8:$H$28,11)","v":"0001"}]
[null,{"$f":"HLOOKUP(Database!$D$7,Database!$D$8:$H$28,12)","v":"0002"},{"$f":"HLOOKUP(Database!$D$7,Database!$D$8:$H$28,12)","v":"0002"}]
[null,{"$f":"HLOOKUP(Database!$D$7,Database!$D$8:$H$28,13)","v":"0004"},{"$f":"HLOOKUP(Database!$D$7,Database!$D$8:$H$28,13)","v":"0004"}]
[null,{"$f":"HLOOKUP(Database!$D$7,Database!$D$8:$H$28,14)","v":"0006"},{"$f":"HLOOKUP(Database!$D$7,Database!$D$8:$H$28,14)","v":"0006"}]
[null,{"$f":"HLOOKUP(Database!$D$7,Database!$D$8:$H$28,15)","v":"0008"},{"$f":"HLOOKUP(Database!$D$7,Database!$D$8:$H$28,15)","v":"0008"}]
[null,{"$f":"HLOOKUP(Database!$D$7,Database!$D$8:$H$28,16)","v":"0011"},{"$f":"HLOOKUP(Database!$D$7,Database!$D$8:$H$28,16)","v":"0011"}]
[null,{"$f":"HLOOKUP(Database!$D$7,Database!$D$8:$H$28,17)","v":"0011"},{"$f":"HLOOKUP(Database!$D$7,Database!$D$8:$H$28,17)","v":"0011"}]
[null,{"$f":"HLOOKUP(Database!$D$7,Database!$D$8:$H$28,18)","v":"0011"},{"$f":"HLOOKUP(Database!$D$7,Database!$D$8:$H$28,18)","v":"0011"}]
[null,{"$f":"HLOOKUP(Database!$D$7,Database!$D$8:$H$28,19)","v":"0011"},{"$f":"HLOOKUP(Database!$D$7,Database!$D$8:$H$28,19)","v":"0011"}]
["Voltage Rating",{"$f":"HLOOKUP(Database!$B$29,Database!$B$30:$D$41,2)","v":"24-27 Vac/Vdc"},{"$f":"HLOOKUP(Database!$B$29,Database!$B$30:$D$41,2)","v":"24-27 Vac/Vdc"}]
[null,{"$f":"HLOOKUP(Database!$B$29,Database!$B$30:$D$41,3)","v":"30-34 Vac/Vdc"},{"$f":"HLOOKUP(Database!$B$29,Database!$B$30:$D$41,3)","v":"30-34 Vac/Vdc"}]
[null,{"$f":"HLOOKUP(Database!$B$29,Database!$B$30:$D$41,4)","v":"48-54 Vac/Vdc"},{"$f":"HLOOKUP(Database!$B$29,Database!$B$30:$D$41,4)","v":"48-54 Vac/Vdc"}]
[null,{"$f":"HLOOKUP(Database!$B$29,Database!$B$30:$D$41,5)","v":"110-125 Vac/Vdc"},{"$f":"HLOOKUP(Database!$B$29,Database!$B$30:$D$41,5)","v":"110-125 Vac/Vdc"}]
[null,{"$f":"HLOOKUP(Database!$B$29,Database!$B$30:$D$41,6)","v":"220-250 Vac/Vdc"},{"$f":"HLOOKUP(Database!$B$29,Database!$B$30:$D$41,6)","v":"220-250 Vac/Vdc"}]
[null,{"$f":"HLOOKUP(Database!$B$29,Database!$B$30:$D$41,7)","v":"0000"},{"$f":"HLOOKUP(Database!$B$29,Database!$B$30:$D$41,7)","v":"0000"}]
[null,{"$f":"HLOOKUP(Database!$B$29,Database!$B$30:$D$41,8)","v":"0250"},{"$f":"HLOOKUP(Database!$B$29,Database!$B$30:$D$41,8)","v":"0250"}]
[null,{"$f":"HLOOKUP(Database!$B$29,Database!$B$30:$D$41,9)","v":"0500"},{"$f":"HLOOKUP(Database!$B$29,Database!$B$30:$D$41,9)","v":"0500"}]
[null,{"$f":"HLOOKUP(Database!$B$29,Database!$B$30:$D$41,10)","v":"0750"},{"$f":"HLOOKUP(Database!$B$29,Database!$B$30:$D$41,10)","v":"0750"}]
[null,{"$f":"HLOOKUP(Database!$B$29,Database!$B$30:$D$41,11)","v":"1000"},{"$f":"HLOOKUP(Database!$B$29,Database!$B$30:$D$41,11)","v":"1000"}]
["Flagging",{"$f":"VLOOKUP(Database!$B$2,Database!$A$3:$M$5,4,FALSE)","v":"Without Flag Indicator"},{"$f":"VLOOKUP(Database!$B$2,Database!$A$3:$M$5,4,FALSE)","v":"Without Flag Indicator"}]
[null,{"$f":"VLOOKUP(Database!$B$2,Database!$A$3:$M$5,5,FALSE)","v":"With Hand Reset Flag Indicator"},{"$f":"VLOOKUP(Database!$B$2,Database!$A$3:$M$5,5,FALSE)","v":"With Hand Reset Flag Indicator"}]
[null,{"$f":"VLOOKUP(Database!$B$2,Database!$A$3:$M$5,6,FALSE)","v":"With Self Reset Flag Indicator"},{"$f":"VLOOKUP(Database!$B$2,Database!$A$3:$M$5,6,FALSE)","v":"With Self Reset Flag Indicator"}]
[null,{"$f":"VLOOKUP(Database!$B$2,Database!$A$3:$M$5,7,FALSE)","v":"A"},{"$f":"VLOOKUP(Database!$B$2,Database!$A$3:$M$5,7,FALSE)","v":"A"}]
[null,{"$f":"VLOOKUP(Database!$B$2,Database!$A$3:$M$5,8,FALSE)","v":"B"},{"$f":"VLOOKUP(Database!$B$2,Database!$A$3:$M$5,8,FALSE)","v":"B"}]
[null,{"$f":"VLOOKUP(Database!$B$2,Database!$A$3:$M$5,9,FALSE)","v":"E"},{"$f":"VLOOKUP(Database!$B$2,Database!$A$3:$M$5,9,FALSE)","v":"E"}]
["Case Cortec Code","J1","R1"]
[null,"L1","T1"]

{"sheet":"Routing","index":8,"n_rows":14,"n_cols":5,"rows_kept":14,"cut":false,"hidden":true,"merged":[]}
[]
[null,"Model No:",{"$f":"BOM!A2","v":"MVAJ14R1BA0001F"}]
[null,"Ref Op Set: "]
[null,"Pre-production Ref Op. Set: "]
[null,{"$f":"'Routing DB'!$D$17","v":"Delete Flash Test Op"}]
[]
[null,"105BA","Assembly & Wire",{"$f":"'Routing DB'!B16","v":17},"Mins"]
[null,"105BB","Product Check",6,"Mins"]
[null,"105BC","Prep for Test",{"$f":"'Routing DB'!H16","v":{"$error":"#N/A"}},"Mins"]
[null,"105DB","Flash Test",{"$f":"'Routing DB'!E7","v":0},"Mins"]
[null,"105DB","Test",{"$f":"'Routing DB'!H8","v":2.2999999999999998},"Mins"]
[null,"106BN","Nameplate Printing",{"$f":"'Routing DB'!E15","v":{"$error":"#N/A"}},"Mins"]
[null,"105BQ","Final Inspection",2,"Mins"]
[null,"105BP","Pack",6.5,"Mins"]

{"sheet":"Routing DB","index":9,"n_rows":36,"n_cols":8,"rows_kept":36,"cut":false,"hidden":true,"merged":[]}
["Assy/Wire",null,null,"Flash Test",null,null,"Test"]
[{"$f":"Configurator!$D$10","v":"B"},{"$f":"VLOOKUP($A$2,$A$3:$B$5,2,FALSE)","v":17},null,{"$f":"Configurator!$D$10","v":"B"},{"$f":"VLOOKUP($D$2,$D$3:$E$5,2,FALSE)","v":0},null,{"$f":"Configurator!$F$5","v":"A"},{"$f":"VLOOKUP($G$2,$G$3:$H$7,2,FALSE)","v":2.2999999999999998}]
["B",17,null,"B",0,null,"A",2.2999999999999998]
["D",60.5,null,"D",5,null,"B",3.2]
["G",68.099999999999994,null,"G",0,null,"C",2.2999999999999998]
[null,null,null,null,null,null,"D",3.2]
[{"$f":"Configurator!G5","v":"0001"},null,null,"Flash Test Time",{"$f":"$E$2","v":0}]
[{"$f":"MID(A7,1,2)","v":"00"},{"$f":"VLOOKUP($A$8,$A$9:$B$14,2,FALSE)","v":0},null,null,null,null,"Test Time",{"$f":"$H$2","v":2.2999999999999998}]
["00",0,null,"Nameplate Print"]
["02",0,null,{"$f":"Configurator!$F$5","v":"A"},{"$f":"VLOOKUP($D$10,$D$11:$E$13,2,FALSE)","v":{"$error":"#N/A"}},null,"Prep for Test"]
["05",0,null,"B",0.6,null,{"$f":"Configurator!$F$5","v":"A"},{"$f":"VLOOKUP($G$11,$G$12:$H$14,2,FALSE)","v":{"$error":"#N/A"}}]
["07",0,null,"D",1.8,null,"B",5.2]
["10",{"$f":"IF(A2=\"B\",2,5.3)","v":2},null,"G",1.8,null,"D",10.3]
["90",0,null,null,null,null,"G",10.3]
[null,null,null,"Test Time",{"$f":"E10","v":{"$error":"#N/A"}}]
["Total Assy/Wire Time",{"$f":"$B$2+$B$8","v":17},null,null,null,null,"Test Time",{"$f":"$H$11","v":{"$error":"#N/A"}}]
[null,null,null,{"$f":"IF(E7=0,\"Delete Flash Test Op\",\" \")","v":"Delete Flash Test Op"}]
[]
[]
["Workings"]
[]
["Ass&Wire"]
["5 Contacts",17]
["PLUS 220V",2]
["10 Contacts",68.099999999999994]
["PLUS 220V","5.3 ?","See Working Sheet for Query !"]
[]
["2 Std + 5 BOM Contacts",60.5,"Only 110V !"]
[]
["Flash Test"]
["0 BOM Contacts",0]
["5 BOM Contacts",5]
[]
["Test"]
["Without Flag",2.2999999999999998,null,"Query as all values"]
["With Flag",3.2,null,"are currently 3.2 mins"]