{"text_format":"1","workbook":"xlsx","n_sheets":8,"sheets":["Disclaimer","Cortec","Configurator","Documents","Master Text","BOM","LOOKUP","Date Drivers"],"not_rendered":{"charts":0,"images":0,"macros":1,"external_links":0,"defined_names":7,"comments":0,"pivot_tables":0},"unopened":[],"bounds":{"document_bytes":16777216,"sheet_cells":100000,"rows_first":2000,"rows_last":500,"rows_between":2000,"halvings":0,"cell_chars":16384,"cell_head_chars":4096},"cells_cut":0,"cells_raw":0,"read":"whole","date_system":"1900"}

{"sheet":"Disclaimer","index":0,"n_rows":6,"n_cols":2,"rows_kept":6,"cut":false,"hidden":false,"merged":[[2,1,2,9],[5,1,7,9],[3,1,4,9]]}
[]
[]
[null,"Our policy is one of continuous development. Accordingly the design of our products may change at any time. "]
[null,"Whilst every effort is made to produce up to date literature, this document should only be regarded as a guide and is intended for information purposes only."]
[]
[null,"Its contents do not constitute an offer for sale or advice on the application of any product referred to in it. We cannot be held responsible for any reliance on any decisions taken on its contents without specific advice."]

{"sheet":"Cortec","index":1,"n_rows":71,"n_cols":12,"rows_kept":71,"cut":false,"hidden":false,"merged":[[2,1,2,12],[44,7,45,7],[46,7,47,7]]}
["Information Required with Order"]
[]
["Variants","Order Number"]
["P743","Busbar Protection Peripheral Unit (60TE)","P743"]
["Vx Aux Rating"]
["24 - 54Vdc (Withdrawn)",null,null,7]
["48 - 125Vdc (40 - 100Vac)",null,null,8]
["110 - 250Vdc (100 - 240Vac)",null,null,9]
[]
["Hardware Options"]
["Without CT Input (Withdrawn)",null,null,null,0]
["With In = 1/5A CT Input",null,null,null,1]
["Redundant Ethernet PRP/Failover, 2 multi-mode fibre ports, IEC 61850-9-2 LE Sampled Analogue Values - Process Bus Model *",null,null,null,"C"]
[]
["Hardware Options"]
["Standard - None",null,null,null,null,1]
["Ethernet (100 Mbits/s) without IRIG-B",null,null,null,null,6]
["2nd Rear Port & InterMiCOM & IRIG-B (Modulated)",null,null,null,null,"E"]
["Redundant Ethernet Self-Healing Ring, 2 multi-mode fibre ports + Modulated IRIG-B",null,null,null,null,"G"]
["Redundant Ethernet Self-Healing Ring, 2 multi-mode fibre ports + Un-modulated IRIG-B ",null,null,null,null,"H"]
{"$rows_left_out":52}
{"sheet":"Configurator","index":2,"n_rows":58,"n_cols":17,"rows_kept":58,"cut":false,"hidden":false,"merged":[[2,2,2,3],[3,2,3,3],[4,2,4,3],[1,0,1,2]]}
["To enable only current variants to be offered, please specify ACTUAL or REQUIRED delivery date here"]
[null,null,null,"Format = dd/mm/yy (where d=day, m=month, y=year)"]
["OPTION",null,"INTERACTIVE CORTEC",null,1,2,"3-4",5,6,7,8,9,10,11,"12-13",14,15]
["SELECTION",null,"Generic Application - Protection and control",null,"P",7,43,{"$f":"VLOOKUP(LOOKUP!$C$16,LOOKUP!$D$16:$E$18,2)","v":9},{"$f":"VLOOKUP(LOOKUP!$C$20,LOOKUP!$D$20:$F$25,3)","v":"1"},{"$f":"VLOOKUP(LOOKUP!$H$55,LOOKUP!$H$56:$K$70,2)","v":"1"},{"$f":"VLOOKUP(LOOKUP!$H$72,LOOKUP!$H$73:$K$76,4)","v":"A"},{"$f":"VLOOKUP(LOOKUP!$H$42,LOOKUP!$G$43:$I$44,3)","v":"1"},{"$f":"VLOOKUP(LOOKUP!$H$84,LOOKUP!$H$85:$J$86,2,FALSE)","v":"S"},{"$f":"VLOOKUP(LOOKUP!$C$42,LOOKUP!$D$42:$E$46,2)","v":"0"},{"$f":"VLOOKUP(LOOKUP!B86,LOOKUP!A87:B92,2,0)","v":"91"},{"$f":"VLOOKUP(LOOKUP!$C$51,LOOKUP!$D$51:$G$53,2)","v":0},{"$f":"VLOOKUP(LOOKUP!$B$98,LOOKUP!$A$99:$C$101,2)","v":"M"}]
[null,null,"Application - Busbar Protection",null,1]
["Design Suffix",{"$f":"HLOOKUP('Date Drivers'!$C$1,'Date Drivers'!$C$2:$AP$60,47)","v":"B"},"\"M\" hardware ",null,{"$f":"HLOOKUP('Date Drivers'!$C$1,'Date Drivers'!$C$2:$AN$170,153)","v":"M"}]
[null,{"$f":"HLOOKUP('Date Drivers'!$C$1,'Date Drivers'!$C$2:$AP$60,48)","v":"K"},"\"K\" hardware",null,{"$f":"HLOOKUP('Date Drivers'!$C$1,'Date Drivers'!$C$2:$AP$60,48)","v":"K"}]
[null,{"$f":"HLOOKUP('Date Drivers'!$C$1,'Date Drivers'!$C$2:$AP$60,48)","v":"K"},"\"B\" hardware- Withdrawn",null,{"$f":"HLOOKUP('Date Drivers'!$C$1,'Date Drivers'!$C$2:$AP$60,47)","v":"B"}]
["Note : Design suffix \"A\" devices are NOT compatible (See Px40.xls)"]
["Software Version",{"$f":"HLOOKUP(LOOKUP!$A$13,'Date Drivers'!$C$2:$AM$60,42)","v":33},"Must be the same  as P741",null,{"$f":"LOOKUP!$B$87","v":"91"}]
[null,{"$f":"HLOOKUP(LOOKUP!$A$13,'Date Drivers'!$C$2:$AM$60,43)","v":40},null,null,{"$f":"LOOKUP!$B$88","v":"92"}]
[null,null,null,null,{"$f":"LOOKUP!$B$89","v":""}]
[null,null,null,null,{"$f":"LOOKUP!$B$90","v":""}]
[null,null,null,null,{"$f":"LOOKUP!$B$91","v":""}]
[null,null,null,null,{"$f":"LOOKUP!$B$92","v":""}]
[]
["Settings Files",null,"Default",null,0]
[null,null,"Customer Specific",null,"A"]
[null,null,{"$f":"LOOKUP!$G$53","v":" "},null,{"$f":"LOOKUP!F53","v":" "}]
["Vx Aux Rating"]
{"$rows_left_out":39}
{"sheet":"Documents","index":3,"n_rows":11,"n_cols":3,"rows_kept":11,"cut":false,"hidden":false,"merged":[]}
[{"$f":"CONCATENATE(Configurator!E4,Configurator!F4,Configurator!G4,Configurator!H4,Configurator!I4,Configurator!J4,Configurator!K4,Configurator!L4,Configurator!M4,Configurator!N4,Configurator!O4,Configurator!P4,Configurator!Q4)","v":"P743911A1S0910M"},null,"MASTER"]
[]
["External Connection Diagram",":",{"$f":"VLOOKUP(LOOKUP!$G$72,LOOKUP!$G$73:$L$76,6)","v":"10P74302"}]
["Outline Diagram",":","GN0040"]
[]
[]
[]
[]
[null,"A","Original derived from P741/2/3 Cortec - 01/08/05"]
[null,"B","Outline Diagram was GN0086 in error - 25/04/06"]
[null,"C","External Connection Diagram was fixed in error - 28/04/06"]

{"sheet":"Master Text","index":4,"n_rows":90,"n_cols":4,"rows_kept":90,"cut":false,"hidden":false,"merged":[[17,0,17,3],[19,0,19,3],[21,0,21,3],[3,0,3,3],[5,0,5,3],[7,0,7,3],[9,0,9,3],[11,0,11,3],[13,0,13,3],[15,0,15,3]]}
[{"$f":"CONCATENATE(Configurator!E4,Configurator!F4,Configurator!G4,Configurator!H4,Configurator!I4,Configurator!J4,Configurator!K4,Configurator!L4,Configurator!M4,Configurator!N4,Configurator!O4,Configurator!P4,Configurator!Q4)","v":"P743911A1S0910M"}]
["Busbar Protection"]
["Product Specific Options"]
[{"$f":"VLOOKUP(LOOKUP!$H$72,LOOKUP!$H$73:$J$80,3,FALSE)","v":"16 Relays Outputs and 24 Status Inputs, OM1"}]
["In Nominal current :"]
[{"$f":"VLOOKUP(LOOKUP!$H$20,LOOKUP!$I$20:$J$23,2)","v":"1/5A"}]
["Vx Nominal auxiliary voltage options :",null,{"$f":"Configurator!$H$4","v":9}]
[{"$f":"VLOOKUP($C$7,Configurator!$B$19:$C$22,2)","v":"110 - 250Vdc (100 - 240Vac)"}]
["Mounting options :",null,{"$f":"Configurator!$M$4","v":"S"}]
[{"$f":"VLOOKUP(LOOKUP!$H$84,LOOKUP!$H$85:$J$86,3,FALSE)","v":"Flush/Panel Mounting with Harsh Env. Coating, with USB Port, Black and Silver Front Panel"}]
["Hardware options :",null,{"$f":"Configurator!$I$4","v":"1"}]
[{"$f":"VLOOKUP(LOOKUP!$C$20,LOOKUP!$D$20:$K$22,8)","v":"With In = 1/5A CT Input"}]
["Communications options :",null,{"$f":"Configurator!$J$4","v":"1"}]
[{"$f":"VLOOKUP(LOOKUP!H55,LOOKUP!$H$56:$J$70,3,FALSE)","v":"Standard - None"}]
["Protocol options :",null,{"$f":"Configurator!$L$4","v":"1"}]
[{"$f":"VLOOKUP(LOOKUP!$C$34,LOOKUP!$D$34:$K$39,8)","v":"Courier (K-Bus)"}]
["Language options :",null,{"$f":"Configurator!$N$4","v":"0"}]
[{"$f":"VLOOKUP($C$17,Configurator!$B$57:$C$58,2,FALSE)","v":"Multilingual - English, French, German, Spanish"}]
["Software Version:"]
[{"$f":"Configurator!$O$4","v":"91"}]
{"$rows_left_out":71}
{"sheet":"BOM","index":5,"n_rows":72,"n_cols":17,"rows_kept":72,"cut":false,"hidden":true,"merged":[[0,1,0,8]]}
[null,"Requirements Key(s) / # of digit in model number",null,null,null,null,null,null,null,"Requirements Keys","Attribute Keys","NUMBER","DESCRIPTION","Slot","Qty.","Slot","Qty. Required"]
[{"$f":"CONCATENATE(Configurator!E4,Configurator!F4,Configurator!G4,Configurator!H4,Configurator!I4,Configurator!J4,Configurator!K4,Configurator!L4,Configurator!M4,Configurator!N4,Configurator!O4,Configurator!P4,Configurator!Q4)","v":"P743911A1S0910M"},5,6,7,8,9,10,"SW",15]
[null,null,null,null,null,null,{"$f":"MID($A$2,10,1)","v":"S"},null,{"$f":"MID($A$2,15,1)","v":"M"},{"$f":"CONCATENATE(I3)","v":"M"},"B","GN0173001","Final Assembly"," ",1,{"$f":"IF($J3=$K3,$N3,\"\")","v":""},{"$f":"IF($J3=$K3,$O3,\"\")","v":""}]
[null,null,{"$f":"MID($A$2,6,1)","v":"1"},null,null,null,{"$f":"MID($A$2,10,1)","v":"S"},null,{"$f":"MID($A$2,15,1)","v":"M"},{"$f":"CONCATENATE(C4,I4)","v":"1M"},"1K","GN0373001","Final Assembly"," ",1,"",""]
[null,null,{"$f":"MID($A$2,6,1)","v":"1"},null,null,null,{"$f":"MID($A$2,10,1)","v":"S"},null,{"$f":"MID($A$2,15,1)","v":"M"},{"$f":"CONCATENATE(C5,I5)","v":"1M"},"2K","GN0373001","Final Assembly"," ",1,"",""]
[null,null,{"$f":"MID($A$2,6,1)","v":"1"},null,null,null,{"$f":"MID($A$2,10,1)","v":"S"},null,{"$f":"MID($A$2,15,1)","v":"M"},{"$f":"CONCATENATE(C6,I6)","v":"1M"},"CK","GN0610001","Final Assembly"," ",1,"",""]
[null,null,null,null,null,null,{"$f":"MID($A$2,10,1)","v":"S"},{"$f":"MID($A$2,12,2)","v":"91"},{"$f":"MID($A$2,15,1)","v":"M"},{"$f":"CONCATENATE(I7)","v":"M"},"K",{"$f":"IF(H7<=\"41\",\"GN0277001\",\"GN0277005\")","v":"GN0277005"},"User Interface"," ",1,"",""]
[null,{"$f":"MID($A$2,5,1)","v":"9"},null,null,null,null,null,null,null,{"$f":"B8","v":"9"},"1","ZN0021001","PCB Assy Px40 Phase 2 PSU 24/54V","Slot 3",1,"",""]
[null,{"$f":"MID($A$2,5,1)","v":"9"},null,null,null,null,null,null,null,{"$f":"B9","v":"9"},"2","ZN0021002","PCB Assy Px40 Phase 2 PSU 48/125V","Slot 3",1,"",""]
[null,{"$f":"MID($A$2,5,1)","v":"9"},null,null,null,null,null,null,null,{"$f":"B10","v":"9"},"3","ZN0021003","PCB Assy Px40 Phase 2 PSU 110/250V","Slot 3",1,"",""]
[null,null,null,null,{"$f":"MID($A$2,8,1)","v":"A"},null,null,null,{"$f":"MID($A$2,15,1)","v":"M"},{"$f":"CONCATENATE(E11,I11)","v":"AM"},"AK","ZN0019001","Px40 Output Relay PCB","Slot 4 PL2:1, Slot 6 PL2:2",2,"",""]
[null,null,null,null,"A",null,null,null,{"$f":"MID($A$2,15,1)","v":"M"},{"$f":"CONCATENATE(E12,I12)","v":"AM"},"AK","ZN0017012","Input Opto Digital PCB (Dual Optos)","Slot 7 PL2:3, Slot 8",2,{"$f":"IF($J12=$K12,$N12,\"\")","v":""},{"$f":"IF($J12=$K12,$O12,\"\")","v":""}]
[null,null,null,null,"A",null,null,null,"M","AM","BK","ZN0019001","Px40 Output Relay PCB","Slot 4 PL2:3, Slot 6 PL2:2",2,"",""]
[null,null,null,null,"A",null,null,null,"M","AM","BK","ZN0017012","Input Opto Digital PCB (Dual Optos)","Slot 8",1,"",""]
[null,null,null,null,"A",null,null,null,"M","AM","BK","ZN0042001","Px40 High Break Relay PCB","Slot 7 PL2:1",1,"",""]
[null,null,null,null,"A",null,null,null,"M","AM","CK","ZN0019001","Px40 Output Relay PCB","Slot 4 PL2:2",1,"",""]
[null,null,null,null,"A",null,null,null,"M","AM","CK","ZN0017012","Input Opto Digital PCB (Dual Optos)","Slot 7 PL2:3, Slot 8",2,"",""]
[null,null,null,null,"A",null,null,null,"M","AM","CK","ZN0042001","Px40 High Break Relay PCB","Slot 6 PL2:1",1,"",""]
[null,null,null,null,"A",null,null,null,"M","AM","DK","ZN0019001","Px40 Output Relay PCB","Slot 4 PL2:3",1,"",""]
[null,null,null,null,"A",null,null,null,"M","AM","DK","ZN0017012","Input Opto Digital PCB (Dual Optos)","Ref 3 Slot 8",1,"",""]
{"$rows_left_out":53}
{"sheet":"LOOKUP","index":6,"n_rows":116,"n_cols":16,"rows_kept":116,"cut":false,"hidden":true,"merged":[]}
["Design Suffix",{"$f":"HLOOKUP('Date Drivers'!$C$1,'Date Drivers'!$C$2:$AM$50,47)","v":"B"},2,1,{"$f":"HLOOKUP('Date Drivers'!$C$1,'Date Drivers'!$C$2:$AM$50,47)","v":"B"},"Phase 1",{"$f":"HLOOKUP($A$13,'Date Drivers'!$C$2:$AB$168,89)","v":"70"},{"$f":"HLOOKUP($A$13,'Date Drivers'!$C$2:$AB$168,95)","v":"70"},{"$f":"HLOOKUP($C$1,$I$7:$J$13,2)","v":"2025-08-16"},{"$f":"HLOOKUP('Date Drivers'!$C$1,'Date Drivers'!$C$2:$AB$62,60)","v":"24 Digital Inputs / 21 Output relays"},"Phase 1",1,1]
[null,{"$f":"HLOOKUP('Date Drivers'!$C$1,'Date Drivers'!$C$2:$AM$50,48)","v":"K"},null,2,{"$f":"HLOOKUP('Date Drivers'!$C$1,'Date Drivers'!$C$2:$AM$50,48)","v":"K"},"Phase 2",{"$f":"HLOOKUP($A$13,'Date Drivers'!$C$2:$AB$168,90)","v":"53- Withdrawn"},{"$f":"HLOOKUP($A$13,'Date Drivers'!$C$2:$AB$168,96)","v":"**"},{"$f":"HLOOKUP($C$1,$I$7:$J$13,3)","v":"2025-08-24"},{"$f":"HLOOKUP('Date Drivers'!$C$1,'Date Drivers'!$C$2:$AB$62,61)","v":"24 Digital Inputs / 16 Output relays"},"Phase 3",6,"*"]
[null,{"$f":"HLOOKUP('Date Drivers'!$C$1,'Date Drivers'!$C$2:$AM$50,48)","v":"K"},null,3,{"$f":"HLOOKUP('Date Drivers'!$C$1,'Date Drivers'!$C$2:$AM$50,48)","v":"K"},"Phase 2",{"$f":"HLOOKUP($A$13,'Date Drivers'!$C$2:$AB$168,91)","v":"60 - Withdrawn"},{"$f":"HLOOKUP($A$13,'Date Drivers'!$C$2:$AB$168,97)","v":"**"},{"$f":"HLOOKUP($C$1,$I$7:$J$13,4)","v":"2025-08-23"},{"$f":"HLOOKUP('Date Drivers'!$C$1,'Date Drivers'!$C$2:$AB$62,61)","v":"24 Digital Inputs / 16 Output relays"},"Phase 3",6,"*"]
[null,{"$f":"HLOOKUP('Date Drivers'!$C$1,'Date Drivers'!$C$2:$AM$50,48)","v":"K"},null,4,{"$f":"HLOOKUP('Date Drivers'!$C$1,'Date Drivers'!$C$2:$AM$50,48)","v":"K"},"Phase 2",{"$f":"HLOOKUP($A$13,'Date Drivers'!$C$2:$AB$168,69)","v":"52 - Withdrawn"},{"$f":"HLOOKUP($A$13,'Date Drivers'!$C$2:$AB$168,68)","v":"**"},{"$f":"HLOOKUP($C$1,$I$7:$J$13,5)","v":"2025-08-22"},{"$f":"HLOOKUP('Date Drivers'!$C$1,'Date Drivers'!$C$2:$AB$62,61)","v":"24 Digital Inputs / 16 Output relays"},"Phase 3",6,"*"]
[null,{"$f":"HLOOKUP('Date Drivers'!$C$1,'Date Drivers'!$C$2:$AM$50,48)","v":"K"},null,5,{"$f":"HLOOKUP('Date Drivers'!$C$1,'Date Drivers'!$C$2:$AM$50,48)","v":"K"},"Phase 2",{"$f":"HLOOKUP($A$13,'Date Drivers'!$C$2:$AB$68,67)","v":"51"},{"$f":"HLOOKUP($A$13,'Date Drivers'!$C$2:$AB$68,64)","v":"51"},{"$f":"HLOOKUP($C$1,$I$7:$J$13,6)","v":"2013-09-03"},{"$f":"HLOOKUP('Date Drivers'!$C$1,'Date Drivers'!$C$2:$AB$62,61)","v":"24 Digital Inputs / 16 Output relays"},"Phase 3",6,"*"]
[null,{"$f":"HLOOKUP('Date Drivers'!$C$1,'Date Drivers'!$C$2:$AM$50,48)","v":"K"},null,6,{"$f":"HLOOKUP('Date Drivers'!$C$1,'Date Drivers'!$C$2:$AM$50,48)","v":"K"},"Phase 2",{"$f":"HLOOKUP($A$13,'Date Drivers'!$C$2:$AB$79,66)","v":"42 - Withdrawn"},{"$f":"HLOOKUP($A$13,'Date Drivers'!$C$2:$AB$79,63)","v":"**"},{"$f":"HLOOKUP($C$1,$I$7:$J$13,7)","v":"2008-04-16"},{"$f":"HLOOKUP('Date Drivers'!$C$1,'Date Drivers'!$C$2:$AB$62,61)","v":"24 Digital Inputs / 16 Output relays"},"Phase 3",6,"*"]
[null,null,null,null,null,null,null,null,1,2]
["Software Version",{"$f":"VLOOKUP($C$1,$D$1:$G$6,4)","v":"53- Withdrawn"},1,1,"70",{"$f":"TODAY()","v":"2025-08-22"},null,null,"2005-02-28",{"$f":"TODAY()-6","v":"2025-08-16"}]
[null,{"$f":"VLOOKUP($C$1,$D$1:$H$3,5)","v":"**"},null,2,"53","2012-05-06",null,null,"2005-02-28",{"$f":"TODAY()+2","v":"2025-08-24"}]
[" ",{"$f":"VLOOKUP($C$1,$D$1:$H$3,5)","v":"**"},null,2,"60","2007-08-08",null,null,"2005-02-28",{"$f":"TODAY()+1","v":"2025-08-23"}]
[null,{"$f":"VLOOKUP($C$1,$D$1:$H$3,5)","v":"**"},null,2,"52","2006-12-06",null,null,"2005-02-28",{"$f":"TODAY()","v":"2025-08-22"}]
[null,{"$f":"VLOOKUP($C$1,$D$1:$H$3,5)","v":"**"},null,2,"51","2008-04-16",null,null,"2005-02-28","2013-09-03"]
[{"$f":"B116","v":"2025-08-25"},{"$f":"VLOOKUP($C$1,$D$1:$H$3,5)","v":"**"},null,2,"42","2008-04-16",null,null,"2005-02-28","2008-04-16"]
[]
[]
["Vx Aux Rating options",8,2,1,8]
["Key Date",9,null,2,9]
[{"$f":"$B$116","v":"2025-08-25"},"",null,"",""]
[]
["Hardware Options",{"$f":"HLOOKUP($A$13,'Date Drivers'!$C$2:$AN$60,8)","v":"*"},2,1,{"$f":"HLOOKUP($A$13,'Date Drivers'!$C$2:$AN$60,8)","v":"*"},{"$f":"HLOOKUP($A$13,'Date Drivers'!$C$2:$AN$60,11)","v":"*"},{"$f":"VLOOKUP(LOOKUP!$C$48,LOOKUP!$E$48:$F$49,2)","v":"10P74302"},{"$f":"Configurator!$I$4","v":"1"},"*","?",{"$f":"HLOOKUP(LOOKUP!$A$13,'Date Drivers'!$C$2:$AC$40,2)","v":"Without CT Input (Withdrawn)"}]
{"$rows_left_out":97}
{"sheet":"Date Drivers","index":7,"n_rows":155,"n_cols":31,"rows_kept":155,"cut":false,"hidden":true,"merged":[]}
["Key Date",null,{"$f":"VLOOKUP(Configurator!$O$4,LOOKUP!A105:B113,2,0)","v":"2025-08-25"}]
[null,null,"2002-03-20","2002-09-03","2002-10-04","2003-07-23","2003-07-24","2004-02-04","2004-02-09","2004-07-14","2004-08-26","2004-10-12","2004-11-01","2005-02-28","2005-09-05","2006-03-01","2006-05-03","2006-12-06","2007-04-06","2007-08-08","2007-12-12","2007-04-16","2012-05-06","2013-06-30","2013-09-03",{"$f":"TODAY()-6","v":"2025-08-16"},{"$f":"TODAY()","v":"2025-08-22"},{"$f":"TODAY()+1","v":"2025-08-23"},{"$f":"TODAY()+2","v":"2025-08-24"},{"$f":"TODAY()+3","v":"2025-08-25"},{"$f":"TODAY()+4","v":"2025-08-26"}]
["Hardware Options",1,"No analogue fitted (Not available)","No analogue fitted (Not available)","No analogue fitted (Not available)","No analogue fitted (Not available)","No analogue fitted (Not available)","Without CT Input","Without CT Input","Without CT Input","Without CT Input (Withdrawn)","Without CT Input (Withdrawn)","Without CT Input (Withdrawn)","Without CT Input (Withdrawn)","Without CT Input (Withdrawn)","Without CT Input (Withdrawn)","Without CT Input (Withdrawn)","Without CT Input (Withdrawn)","Without CT Input (Withdrawn)","Without CT Input (Withdrawn)","Without CT Input (Withdrawn)","Without CT Input (Withdrawn)","Without CT Input (Withdrawn)","Without CT Input (Withdrawn)","Without CT Input (Withdrawn)","Without CT Input (Withdrawn)","Without CT Input (Withdrawn)","Redundant Ethernet PRP/Failover, 2 multi-mode fibre ports, IEC 61850-9-2 LE Sampled Analogue Values - Process Bus Model","Without CT Input (Withdrawn)","Without CT Input (Withdrawn)","Without CT Input (Withdrawn)"]
[null,2,"With analogue input","With analogue input","With analogue input","With analogue input","With analogue input","With CT Input","With In = 1/5A CT Input","With In = 1/5A CT Input","With In = 1/5A CT Input","With In = 1/5A CT Input","With In = 1/5A CT Input","With In = 1/5A CT Input","With In = 1/5A CT Input","With In = 1/5A CT Input","With In = 1/5A CT Input","With In = 1/5A CT Input","With In = 1/5A CT Input","With In = 1/5A CT Input","With In = 1/5A CT Input","With In = 1/5A CT Input","With In = 1/5A CT Input","With In = 1/5A CT Input","With In = 1/5A CT Input","With In = 1/5A CT Input","With In = 1/5A CT Input"," ","With In = 1/5A CT Input","With In = 1/5A CT Input","With In = 1/5A CT Input"]
[null,3," "," "," "," "," "," "," "," "," "," "," "," "," "," "," ","Redundant Ethernet PRP/Failover, 2 multi-mode fibre ports, IEC 61850-9-2 LE Sampled Analogue Values - Process Bus Model","Redundant Ethernet PRP/Failover, 2 multi-mode fibre ports, IEC 61850-9-2 LE Sampled Analogue Values - Process Bus Model","Redundant Ethernet PRP/Failover, 2 multi-mode fibre ports, IEC 61850-9-2 LE Sampled Analogue Values - Process Bus Model","Redundant Ethernet PRP/Failover, 2 multi-mode fibre ports, IEC 61850-9-2 LE Sampled Analogue Values - Process Bus Model"," ","Redundant Ethernet PRP/Failover, 2 multi-mode fibre ports, IEC 61850-9-2 LE Sampled Analogue Values - Process Bus Model","Redundant Ethernet PRP/Failover, 2 multi-mode fibre ports, IEC 61850-9-2 LE Sampled Analogue Values - Process Bus Model","Redundant Ethernet PRP/Failover, 2 multi-mode fibre ports, IEC 61850-9-2 LE Sampled Analogue Values - Process Bus Model","Redundant Ethernet PRP/Failover, 2 multi-mode fibre ports, IEC 61850-9-2 LE Sampled Analogue Values - Process Bus Model","Redundant Ethernet PRP/Failover, 2 multi-mode fibre ports, IEC 61850-9-2 LE Sampled Analogue Values - Process Bus Model"," ","Redundant Ethernet PRP/Failover, 2 multi-mode fibre ports, IEC 61850-9-2 LE Sampled Analogue Values - Process Bus Model","Redundant Ethernet PRP/Failover, 2 multi-mode fibre ports, IEC 61850-9-2 LE Sampled Analogue Values - Process Bus Model","Redundant Ethernet PRP/Failover, 2 multi-mode fibre ports, IEC 61850-9-2 LE Sampled Analogue Values - Process Bus Model"]
[null,4," "," "," "," "," "," "," "," "," "," "," "," "," "," "," "," "," "," "," "," "," "," "," "," "," "," "," "," "," "]
[null,5," "," "," "," "," "," "," "," "," "," "," "," "," "," "," "," "," "," "," "," "," "," "," "," "," "," "," "," "," "]
[null,6," "," "," "," "," "," "," "," "," "," "," "," "," "," "," "," "," "," "," "," "," "," "," "," "," "," "," "," "," "]
[null,1,"*","*","*","*","*","*","*","*","*","*","*","*","*","*","*","*","*","*","*","*","*","*","*","*","*","C","*","*","*"]
[null,2,"1","1","1","1","1","1","1","1","1","1","1","1","1","1","1","1","1","1","1","1","1","1","1","1","1"," ","1","1","1"]
[null,3,"1","*"," "," "," "," "," "," "," "," "," "," "," "," "," "," "," "," "," "," "," "," "," "," "," "," "," "," "," "]
[null,4,"1","1","*","*","*","*","*","*","*","*","*","*","*","*","*","*","*","*","*","*","*","*","*","*","*","C","*","*","*"]
[null,5,"1","1","1","1","1","1","1","1","1","1","1","1","1","1","1","1","1","1","1","1","1","1","1","1","1","C","1","1","1"]
[null,6,"1","1",1,1,1,1,1,1,1,1,1,1,1,1,1,1,1,1,1,1,1,1,1,1,1,"C",1,1,1]
["Communications Options",1,"None","None","None","None","None","None","None","None","None","None","None","None","None","None","Standard - None","Standard - None","Standard - None","Standard - None","Standard - None","Standard - None","Standard - None","Standard - None","Standard - None","Ethernet (100Mbit/s)","Standard - None","Standard - None","Standard - None","Standard - None","Standard - None"]
[null,2," "," "," "," "," "," "," "," "," "," "," "," "," "," "," "," "," ","Ethernet (100Mbit/s)","Ethernet (100Mbit/s)","Ethernet (100Mbit/s)","Ethernet (100Mbit/s)","Ethernet (100Mbit/s)","Ethernet (100Mbit/s)","Redundant Ethernet RSTP, 2 multi-mode fibre ports + Modulated IRIG-B ","Ethernet (100Mbit/s)","Ethernet (100Mbit/s)","2nd Rear Port & intermicom (No Irig-B) - Withdrawn","2nd Rear Port & intermicom (No Irig-B) - Withdrawn","2nd Rear Port & intermicom (No Irig-B) - Withdrawn"]
[null,3," "," "," "," "," "," "," "," "," "," "," "," "," "," "," "," "," "," ","2nd Rear Port & intermicom (No Irig-B) - Withdrawn","2nd Rear Port & intermicom (No Irig-B) - Withdrawn","2nd Rear Port & intermicom (No Irig-B) - Withdrawn","2nd Rear Port & intermicom (No Irig-B) - Withdrawn","2nd Rear Port & intermicom (No Irig-B) - Withdrawn","Redundant Ethernet RSTP, 2 multi-mode fibre ports + Un-modulated IRIG-B ","2nd Rear Port & intermicom (No Irig-B) - Withdrawn","2nd Rear Port & intermicom (No Irig-B) - Withdrawn","Redundant Ethernet PRP/HSR/RSTP/Failover, 2 multi-mode fibre ports + Modulated/Un-Modulated IRIG-B (withdrawn)","Redundant Ethernet PRP/HSR/RSTP/Failover, 2 multi-mode fibre ports + Modulated/Un-Modulated IRIG-B (withdrawn)","Redundant Ethernet PRP/HSR/RSTP/Failover, 2 multi-mode fibre ports + Modulated/Un-Modulated IRIG-B (withdrawn)"]
[null,4," "," "," "," "," "," "," "," "," "," "," "," "," "," "," "," "," "," "," "," "," "," "," "," "," "," "," "," "," "]
[null,5," "," "," "," "," "," "," "," "," "," "," "," "," "," "," "," "," "," "," "," "," "," "," "," "," "," "," "," "," "]
[null,6," "," "," "," "," "," "," "," "," "," "," "," "," "," "," "," "," "," "," "," "," "," "," "," "," "," "," "," "," "]
{"$rows_left_out":135}